{"text_format":"1","workbook":"xlsx","n_sheets":5,"sheets":["座標入力","面積計算","2点間距離","逆計算","放射トラバース"],"not_rendered":{"charts":0,"images":0,"macros":1,"external_links":0,"defined_names":3,"comments":5,"pivot_tables":0},"unopened":[],"bounds":{"document_bytes":16777216,"sheet_cells":100000,"rows_first":2000,"rows_last":500,"rows_between":2000,"halvings":0,"cell_chars":16384,"cell_head_chars":4096},"cells_cut":0,"cells_raw":0,"read":"whole","date_system":"1900"}

{"sheet":"座標入力","index":0,"n_rows":402,"n_cols":10,"rows_kept":402,"cut":false,"hidden":false,"merged":[[0,1,0,2],[3,9,3,10],[2,9,2,10],[0,4,0,7]]}
[null,"座 標 入 力",null,"件名：","福岡市○○区△△町１丁目地内道路測量"]
["NO","測点","Ｘ","Ｙ","標　高","備　考"]
[1,null,null,null,null,null,null,null,"シリアル番号","C04O05K05U00DS1"]
[2,null,null,null,null,null,null,null,"使　用　者","座標入力使用者に名前入力"]
[3]
[4]
[5]
[6]
[7]
[8]
[9]
[10]
[11]
[12]
[13]
[14]
[15]
[16]
[17]
[18]
[19]
[20]
[21]
[22]
[23]
[24]
[25]
[26]
[27]
[28]
[29]
[30]
[31]
[32]
[33]
[34]
[35]
[36]
[37]
[38]
[39]
[40]
[41]
[42]
[43]
[44]
[45]
[46]
[47]
[48]
[49]
[50]
[51]
[52]
[53]
[54]
[55]
[56]
[57]
[58]
[59]
[60]
[61]
[62]
[63]
[64]
[65]
[66]
[67]
[68]
[69]
[70]
[71]
[72]
[73]
[74]
[75]
[76]
[77]
[78]
[79]
[80]
[81]
[82]
[83]
[84]
[85]
[86]
[87]
[88]
[89]
[90]
[91]
[92]
[93]
[94]
[95]
[96]
[97]
[98]
[99]
[100]
[101]
[102]
[103]
[104]
[105]
[106]
[107]
[108]
[109]
[110]
[111]
[112]
[113]
[114]
[115]
[116]
[117]
[118]
[119]
[120]
[121]
[122]
[123]
[124]
[125]
[126]
[127]
[128]
[129]
[130]
[131]
[132]
[133]
[134]
[135]
[136]
[137]
[138]
[139]
[140]
[141]
[142]
[143]
[144]
[145]
[146]
[147]
[148]
[149]
[150]
[151]
[152]
[153]
[154]
[155]
[156]
[157]
[158]
[159]
[160]
[161]
[162]
[163]
[164]
[165]
[166]
[167]
[168]
[169]
[170]
[171]
[172]
[173]
[174]
[175]
[176]
[177]
[178]
[179]
[180]
[181]
[182]
[183]
[184]
[185]
[186]
[187]
[188]
[189]
[190]
[191]
[192]
[193]
[194]
[195]
[196]
[197]
[198]
[199]
[200]
[201]
[202]
[203]
[204]
[205]
[206]
[207]
[208]
[209]
[210]
[211]
[212]
[213]
[214]
[215]
[216]
[217]
[218]
[219]
[220]
[221]
[222]
[223]
[224]
[225]
[226]
[227]
[228]
[229]
[230]
[231]
[232]
[233]
[234]
[235]
[236]
[237]
[238]
[239]
[240]
[241]
[242]
[243]
[244]
[245]
[246]
[247]
[248]
[249]
[250]
[251]
[252]
[253]
[254]
[255]
[256]
[257]
[258]
[259]
[260]
[261]
[262]
[263]
[264]
[265]
[266]
[267]
[268]
[269]
[270]
[271]
[272]
[273]
[274]
[275]
[276]
[277]
[278]
[279]
[280]
[281]
[282]
[283]
[284]
[285]
[286]
[287]
[288]
[289]
[290]
[291]
[292]
[293]
[294]
[295]
[296]
[297]
[298]
[299]
[300]
[301]
[302]
[303]
[304]
[305]
[306]
[307]
[308]
[309]
[310]
[311]
[312]
[313]
[314]
[315]
[316]
[317]
[318]
[319]
[320]
[321]
[322]
[323]
[324]
[325]
[326]
[327]
[328]
[329]
[330]
[331]
[332]
[333]
[334]
[335]
[336]
[337]
[338]
[339]
[340]
[341]
[342]
[343]
[344]
[345]
[346]
[347]
[348]
[349]
[350]
[351]
[352]
[353]
[354]
[355]
[356]
[357]
[358]
[359]
[360]
[361]
[362]
[363]
[364]
[365]
[366]
[367]
[368]
[369]
[370]
[371]
[372]
[373]
[374]
[375]
[376]
[377]
[378]
[379]
[380]
[381]
[382]
[383]
[384]
[385]
[386]
[387]
[388]
[389]
[390]
[391]
[392]
[393]
[394]
[395]
[396]
[397]
[398]
[399]
[400]

{"sheet":"面積計算","index":1,"n_rows":185,"n_cols":9,"rows_kept":185,"cut":false,"hidden":false,"merged":[[62,0,62,1],[64,0,64,1],[63,0,63,1],[60,0,60,1],[184,0,184,1],[65,0,65,1],[66,0,66,1],[67,0,67,1],[68,0,68,1],[183,0,183,1],[69,0,69,1],[70,0,70,1],[71,0,71,1],[72,0,72,1],[0,3,0,5],[48,0,48,1],[57,0,57,1],[51,0,51,1],[52,0,52,1],[53,0,53,1],[54,0,54,1],[49,0,49,1],[55,0,55,1],[56,0,56,1],[1,1,1,5],[60,3,60,5],[34,0,34,1],[35,0,35,1],[36,0,36,1],[37,0,37,1],[22,0,22,1],[23,0,23,1],[21,0,21,1],[2,2,2,6],[5,2,5,4],[16,0,16,1],[17,0,17,1],[2,0,3,0],[6,0,6,1],[7,0,7,1],[28,0,28,1],[29,0,29,1],[12,0,12,1],[38,0,38,1],[25,0,25,1],[24,0,24,1],[31,0,31,1],[32,0,32,1],[30,0,30,1],[27,0,27,1],[19,0,19,1],[20,0,20,1],[73,0,73,1],[74,0,74,1],[14,0,14,1],[15,0,15,1],[5,0,5,1],[8,0,8,1],[33,0,33,1],[26,0,26,1],[50,0,50,1],[39,0,39,1],[40,0,40,1],[41,0,41,1],[42,0,42,1],[43,0,43,1],[45,0,45,1],[44,0,44,1],[46,0,46,1],[47,0,47,1],[58,0,58,1],[59,0,59,1],[81,0,81,1],[82,0,82,1],[83,0,83,1],[84,0,84,1],[85,0,85,1],[86,0,86,1],[75,0,75,1],[76,0,76,1],[77,0,77,1],[78,0,78,1],[79,0,79,1],[80,0,80,1],[106,0,106,1],[107,0,107,1],[93,0,93,1],[94,0,94,1],[95,0,95,1],[96,0,96,1],[97,0,97,1],[98,0,98,1],[87,0,87,1],[88,0,88,1],[89,0,89,1],[90,0,90,1],[91,0,91,1],[92,0,92,1],[128,0,128,1],[129,0,129,1],[125,0,125,1],[126,0,126,1],[127,0,127,1],[130,0,130,1],[124,0,124,1],[181,0,181,1],[182,0,182,1],[151,0,151,1],[152,0,152,1],[137,0,137,1],[138,0,138,1],[139,0,139,1],[140,0,140,1],[141,0,141,1],[142,0,142,1],[131,0,131,1],[132,0,132,1],[133,0,133,1],[134,0,134,1],[135,0,135,1],[136,0,136,1],[180,0,180,1],[111,0,111,1],[112,0,112,1],[113,0,113,1],[115,0,115,1],[179,0,179,1],[175,0,175,1],[176,0,176,1],[167,0,167,1],[168,0,168,1],[169,0,169,1],[170,0,170,1],[171,0,171,1],[172,0,172,1],[161,0,161,1],[162,0,162,1],[163,0,163,1],[164,0,164,1],[165,0,165,1],[166,0,166,1],[155,0,155,1],[156,0,156,1],[157,0,157,1],[158,0,158,1],[177,0,177,1],[178,0,178,1],[123,2,123,3],[61,0,61,1],[61,2,61,3],[109,0,109,1],[110,0,110,1],[123,0,123,1],[122,0,122,1],[105,0,105,1],[173,0,173,1],[174,0,174,1],[159,0,159,1],[160,0,160,1],[154,0,154,1],[147,0,147,1],[148,0,148,1],[149,0,149,1],[150,0,150,1],[153,0,153,1],[143,0,143,1],[144,0,144,1],[145,0,145,1],[146,0,146,1],[2,11,2,12],[3,11,3,12],[61,4,61,5],[123,4,123,5],[4,0,4,6],[18,0,18,1],[10,0,10,1],[11,0,11,1],[9,0,9,1],[13,0,13,1],[114,0,114,1],[118,0,118,1],[119,0,119,1],[120,0,120,1],[117,0,117,1],[116,0,116,1],[121,0,121,1],[99,0,99,1],[100,0,100,1],[108,0,108,1],[101,0,101,1],[102,0,102,1],[103,0,103,1],[104,0,104,1]]}
[null,null,null,"座標面積計算書",null,null,{"$f":"IF(I11=0,\"\",IF(AND(I8<>0,I9=0),\"(1/1)\",IF(AND(I9<>0,I10=0),\"(1/2)\",\"(1/3)\")))","v":""}]
[{"$f":"座標入力!$D$1","v":"件名："},{"$f":"座標入力!$E$1","v":"福岡市○○区△△町１丁目地内道路測量"},null,null,null,null,"2016-06-16"]
["土地の\n表　示","所 在"]
[null,"地 目",null,"地　積",null,"所 有 者"]
[]
["種　   別",null,"道路用地拡幅の為",null,null,"計 算 者","博多花子"]
["測　　　点",null,"Ｘ","Ｙ","距　　　離","Ｘｎ+1－Ｘｎ-1","Ｙ(Ｘｎ+1－Ｘｎ-1)"]
[null,null,{"$f":"IF(A8=\"\",\"\",VLOOKUP(A8,座標入力!$B$3:$D$402,2,FALSE))","v":""},{"$f":"IF(A8=\"\",\"\",VLOOKUP(A8,座標入力!$B$3:$D$402,3,FALSE))","v":""},{"$f":"IF(OR(C8=\"\",A9=\"\"),\"\",ROUND(IF(AND(C9=\"\",D9=\"\"),SQRT(($C$8-C8)^2+($D$8-D8)^2),SQRT((C9-C8)^2+(D9-D8)^2)),3))","v":""},{"$f":"IF(OR(A8=\"\",A9=\"\"),\"\",IF(AND(I9=0,I10=0),$C$9-INDEX($C$8:C57,MAX(IF($C$8:C57<>\"\",ROW($C$8:C57)-7)),1),\nIF(AND(I9<>0,I10=0),$C$9-INDEX($C$64:C119,MAX(IF($C$64:C119<>\"\",ROW($C$64:C119)-63)),1),$C$9-INDEX($C$126:C181,MAX(IF($C$126:C181<>\"\",ROW($C$126:C181)-125)),1))))","v":""},{"$f":"IF(OR(D8=\"\",F8=\"\"),\"\",D8*F8)","v":""},null,{"$f":"COUNTA(A8:B57)","v":0}]
[null,null,{"$f":"IF(A9=\"\",\"\",VLOOKUP(A9,座標入力!$B$3:$D$402,2,FALSE))","v":""},{"$f":"IF(A9=\"\",\"\",VLOOKUP(A9,座標入力!$B$3:$D$402,3,FALSE))","v":""},{"$f":"IF(C9=\"\",\"\",ROUND(IF(AND(C10=\"\",D10=\"\"),SQRT(($C$8-C9)^2+($D$8-D9)^2),SQRT((C10-C9)^2+(D10-D9)^2)),3))","v":""},{"$f":"IF(C9=\"\",\"\",IF(C10=\"\",$C$8-C8,C10-C8))","v":""},{"$f":"IF(OR(D9=\"\",F9=\"\"),\"\",D9*F9)","v":""},null,{"$f":"COUNTA(A64:B119)","v":0}]
[null,null,{"$f":"IF(A10=\"\",\"\",VLOOKUP(A10,座標入力!$B$3:$D$402,2,FALSE))","v":""},{"$f":"IF(A10=\"\",\"\",VLOOKUP(A10,座標入力!$B$3:$D$402,3,FALSE))","v":""},"",{"$f":"IF(C10=\"\",\"\",IF(C11=\"\",$C$8-C9,C11-C9))","v":""},"",null,{"$f":"COUNTA(A126:B180)","v":0}]
[null,null,{"$f":"IF(A11=\"\",\"\",VLOOKUP(A11,座標入力!$B$3:$D$402,2,FALSE))","v":""},{"$f":"IF(A11=\"\",\"\",VLOOKUP(A11,座標入力!$B$3:$D$402,3,FALSE))","v":""},"",{"$f":"IF(C11=\"\",\"\",IF(C12=\"\",$C$8-C10,C12-C10))","v":""},"",null,{"$f":"SUM(I8:I10)","v":0}]
[null,null,{"$f":"IF(A12=\"\",\"\",VLOOKUP(A12,座標入力!$B$3:$D$402,2,FALSE))","v":""},{"$f":"IF(A12=\"\",\"\",VLOOKUP(A12,座標入力!$B$3:$D$402,3,FALSE))","v":""},"","",""]
[null,null,{"$f":"IF(A13=\"\",\"\",VLOOKUP(A13,座標入力!$B$3:$D$402,2,FALSE))","v":""},{"$f":"IF(A13=\"\",\"\",VLOOKUP(A13,座標入力!$B$3:$D$402,3,FALSE))","v":""},"","",{"$f":"IF(OR(D13=\"\",F13=\"\"),\"\",D13*F13)","v":""}]
[null,null,{"$f":"IF(A14=\"\",\"\",VLOOKUP(A14,座標入力!$B$3:$D$402,2,FALSE))","v":""},{"$f":"IF(A14=\"\",\"\",VLOOKUP(A14,座標入力!$B$3:$D$402,3,FALSE))","v":""},"","",""]
[null,null,{"$f":"IF(A15=\"\",\"\",VLOOKUP(A15,座標入力!$B$3:$D$402,2,FALSE))","v":""},{"$f":"IF(A15=\"\",\"\",VLOOKUP(A15,座標入力!$B$3:$D$402,3,FALSE))","v":""},"","",""]
[null,null,{"$f":"IF(A16=\"\",\"\",VLOOKUP(A16,座標入力!$B$3:$D$402,2,FALSE))","v":""},{"$f":"IF(A16=\"\",\"\",VLOOKUP(A16,座標入力!$B$3:$D$402,3,FALSE))","v":""},"","",""]
[null,null,{"$f":"IF(A17=\"\",\"\",VLOOKUP(A17,座標入力!$B$3:$D$402,2,FALSE))","v":""},{"$f":"IF(A17=\"\",\"\",VLOOKUP(A17,座標入力!$B$3:$D$402,3,FALSE))","v":""},"","",""]
[null,null,{"$f":"IF(A18=\"\",\"\",VLOOKUP(A18,座標入力!$B$3:$D$402,2,FALSE))","v":""},{"$f":"IF(A18=\"\",\"\",VLOOKUP(A18,座標入力!$B$3:$D$402,3,FALSE))","v":""},"","",""]
[null,null,{"$f":"IF(A19=\"\",\"\",VLOOKUP(A19,座標入力!$B$3:$D$402,2,FALSE))","v":""},{"$f":"IF(A19=\"\",\"\",VLOOKUP(A19,座標入力!$B$3:$D$402,3,FALSE))","v":""},"","",""]
[null,null,{"$f":"IF(A20=\"\",\"\",VLOOKUP(A20,座標入力!$B$3:$D$402,2,FALSE))","v":""},{"$f":"IF(A20=\"\",\"\",VLOOKUP(A20,座標入力!$B$3:$D$402,3,FALSE))","v":""},"","",""]
[null,null,{"$f":"IF(A21=\"\",\"\",VLOOKUP(A21,座標入力!$B$3:$D$402,2,FALSE))","v":""},{"$f":"IF(A21=\"\",\"\",VLOOKUP(A21,座標入力!$B$3:$D$402,3,FALSE))","v":""},"","",""]
[null,null,{"$f":"IF(A22=\"\",\"\",VLOOKUP(A22,座標入力!$B$3:$D$402,2,FALSE))","v":""},{"$f":"IF(A22=\"\",\"\",VLOOKUP(A22,座標入力!$B$3:$D$402,3,FALSE))","v":""},"","",""]
[null,null,{"$f":"IF(A23=\"\",\"\",VLOOKUP(A23,座標入力!$B$3:$D$402,2,FALSE))","v":""},{"$f":"IF(A23=\"\",\"\",VLOOKUP(A23,座標入力!$B$3:$D$402,3,FALSE))","v":""},"","",""]
[null,null,{"$f":"IF(A24=\"\",\"\",VLOOKUP(A24,座標入力!$B$3:$D$402,2,FALSE))","v":""},{"$f":"IF(A24=\"\",\"\",VLOOKUP(A24,座標入力!$B$3:$D$402,3,FALSE))","v":""},"","",{"$f":"IF(OR(D24=\"\",F24=\"\"),\"\",D24*F24)","v":""}]
[null,null,{"$f":"IF(A25=\"\",\"\",VLOOKUP(A25,座標入力!$B$3:$D$402,2,FALSE))","v":""},{"$f":"IF(A25=\"\",\"\",VLOOKUP(A25,座標入力!$B$3:$D$402,3,FALSE))","v":""},"","",""]
[null,null,{"$f":"IF(A26=\"\",\"\",VLOOKUP(A26,座標入力!$B$3:$D$402,2,FALSE))","v":""},{"$f":"IF(A26=\"\",\"\",VLOOKUP(A26,座標入力!$B$3:$D$402,3,FALSE))","v":""},"","",""]
[null,null,{"$f":"IF(A27=\"\",\"\",VLOOKUP(A27,座標入力!$B$3:$D$402,2,FALSE))","v":""},{"$f":"IF(A27=\"\",\"\",VLOOKUP(A27,座標入力!$B$3:$D$402,3,FALSE))","v":""},"","",""]
[null,null,{"$f":"IF(A28=\"\",\"\",VLOOKUP(A28,座標入力!$B$3:$D$402,2,FALSE))","v":""},{"$f":"IF(A28=\"\",\"\",VLOOKUP(A28,座標入力!$B$3:$D$402,3,FALSE))","v":""},"","",""]
[null,null,{"$f":"IF(A29=\"\",\"\",VLOOKUP(A29,座標入力!$B$3:$D$402,2,FALSE))","v":""},{"$f":"IF(A29=\"\",\"\",VLOOKUP(A29,座標入力!$B$3:$D$402,3,FALSE))","v":""},"","",""]
[null,null,{"$f":"IF(A30=\"\",\"\",VLOOKUP(A30,座標入力!$B$3:$D$402,2,FALSE))","v":""},{"$f":"IF(A30=\"\",\"\",VLOOKUP(A30,座標入力!$B$3:$D$402,3,FALSE))","v":""},"","",""]
[null,null,{"$f":"IF(A31=\"\",\"\",VLOOKUP(A31,座標入力!$B$3:$D$402,2,FALSE))","v":""},{"$f":"IF(A31=\"\",\"\",VLOOKUP(A31,座標入力!$B$3:$D$402,3,FALSE))","v":""},"","",""]
[null,null,{"$f":"IF(A32=\"\",\"\",VLOOKUP(A32,座標入力!$B$3:$D$402,2,FALSE))","v":""},{"$f":"IF(A32=\"\",\"\",VLOOKUP(A32,座標入力!$B$3:$D$402,3,FALSE))","v":""},"","",""]
[null,null,{"$f":"IF(A33=\"\",\"\",VLOOKUP(A33,座標入力!$B$3:$D$402,2,FALSE))","v":""},{"$f":"IF(A33=\"\",\"\",VLOOKUP(A33,座標入力!$B$3:$D$402,3,FALSE))","v":""},"","",""]
[null,null,{"$f":"IF(A34=\"\",\"\",VLOOKUP(A34,座標入力!$B$3:$D$402,2,FALSE))","v":""},{"$f":"IF(A34=\"\",\"\",VLOOKUP(A34,座標入力!$B$3:$D$402,3,FALSE))","v":""},"","",""]
[null,null,{"$f":"IF(A35=\"\",\"\",VLOOKUP(A35,座標入力!$B$3:$D$402,2,FALSE))","v":""},{"$f":"IF(A35=\"\",\"\",VLOOKUP(A35,座標入力!$B$3:$D$402,3,FALSE))","v":""},"","",""]
[null,null,{"$f":"IF(A36=\"\",\"\",VLOOKUP(A36,座標入力!$B$3:$D$402,2,FALSE))","v":""},{"$f":"IF(A36=\"\",\"\",VLOOKUP(A36,座標入力!$B$3:$D$402,3,FALSE))","v":""},"","",""]
[null,null,{"$f":"IF(A37=\"\",\"\",VLOOKUP(A37,座標入力!$B$3:$D$402,2,FALSE))","v":""},{"$f":"IF(A37=\"\",\"\",VLOOKUP(A37,座標入力!$B$3:$D$402,3,FALSE))","v":""},"","",""]
[null,null,{"$f":"IF(A38=\"\",\"\",VLOOKUP(A38,座標入力!$B$3:$D$402,2,FALSE))","v":""},{"$f":"IF(A38=\"\",\"\",VLOOKUP(A38,座標入力!$B$3:$D$402,3,FALSE))","v":""},{"$f":"IF(C38=\"\",\"\",ROUND(IF(AND(C39=\"\",D39=\"\"),SQRT(($C$8-C38)^2+($D$8-D38)^2),SQRT((C39-C38)^2+(D39-D38)^2)),3))","v":""},"",""]
[null,null,{"$f":"IF(A39=\"\",\"\",VLOOKUP(A39,座標入力!$B$3:$D$402,2,FALSE))","v":""},{"$f":"IF(A39=\"\",\"\",VLOOKUP(A39,座標入力!$B$3:$D$402,3,FALSE))","v":""},{"$f":"IF(C39=\"\",\"\",ROUND(IF(AND(C40=\"\",D40=\"\"),SQRT(($C$8-C39)^2+($D$8-D39)^2),SQRT((C40-C39)^2+(D40-D39)^2)),3))","v":""},"",""]
[null,null,{"$f":"IF(A40=\"\",\"\",VLOOKUP(A40,座標入力!$B$3:$D$402,2,FALSE))","v":""},{"$f":"IF(A40=\"\",\"\",VLOOKUP(A40,座標入力!$B$3:$D$402,3,FALSE))","v":""},"","",""]
[null,null,{"$f":"IF(A41=\"\",\"\",VLOOKUP(A41,座標入力!$B$3:$D$402,2,FALSE))","v":""},{"$f":"IF(A41=\"\",\"\",VLOOKUP(A41,座標入力!$B$3:$D$402,3,FALSE))","v":""},"","",""]
[null,null,{"$f":"IF(A42=\"\",\"\",VLOOKUP(A42,座標入力!$B$3:$D$402,2,FALSE))","v":""},{"$f":"IF(A42=\"\",\"\",VLOOKUP(A42,座標入力!$B$3:$D$402,3,FALSE))","v":""},"","",""]
[null,null,{"$f":"IF(A43=\"\",\"\",VLOOKUP(A43,座標入力!$B$3:$D$402,2,FALSE))","v":""},{"$f":"IF(A43=\"\",\"\",VLOOKUP(A43,座標入力!$B$3:$D$402,3,FALSE))","v":""},"","",""]
[null,null,{"$f":"IF(A44=\"\",\"\",VLOOKUP(A44,座標入力!$B$3:$D$402,2,FALSE))","v":""},{"$f":"IF(A44=\"\",\"\",VLOOKUP(A44,座標入力!$B$3:$D$402,3,FALSE))","v":""},"","",""]
[null,null,{"$f":"IF(A45=\"\",\"\",VLOOKUP(A45,座標入力!$B$3:$D$402,2,FALSE))","v":""},{"$f":"IF(A45=\"\",\"\",VLOOKUP(A45,座標入力!$B$3:$D$402,3,FALSE))","v":""},"","",""]
[null,null,{"$f":"IF(A46=\"\",\"\",VLOOKUP(A46,座標入力!$B$3:$D$402,2,FALSE))","v":""},{"$f":"IF(A46=\"\",\"\",VLOOKUP(A46,座標入力!$B$3:$D$402,3,FALSE))","v":""},"","",""]
[null,null,{"$f":"IF(A47=\"\",\"\",VLOOKUP(A47,座標入力!$B$3:$D$402,2,FALSE))","v":""},{"$f":"IF(A47=\"\",\"\",VLOOKUP(A47,座標入力!$B$3:$D$402,3,FALSE))","v":""},"","",""]
[null,null,{"$f":"IF(A48=\"\",\"\",VLOOKUP(A48,座標入力!$B$3:$D$402,2,FALSE))","v":""},{"$f":"IF(A48=\"\",\"\",VLOOKUP(A48,座標入力!$B$3:$D$402,3,FALSE))","v":""},"","",""]
[null,null,{"$f":"IF(A49=\"\",\"\",VLOOKUP(A49,座標入力!$B$3:$D$402,2,FALSE))","v":""},{"$f":"IF(A49=\"\",\"\",VLOOKUP(A49,座標入力!$B$3:$D$402,3,FALSE))","v":""},"","",""]
[null,null,{"$f":"IF(A50=\"\",\"\",VLOOKUP(A50,座標入力!$B$3:$D$402,2,FALSE))","v":""},{"$f":"IF(A50=\"\",\"\",VLOOKUP(A50,座標入力!$B$3:$D$402,3,FALSE))","v":""},"","",""]
[null,null,{"$f":"IF(A51=\"\",\"\",VLOOKUP(A51,座標入力!$B$3:$D$402,2,FALSE))","v":""},{"$f":"IF(A51=\"\",\"\",VLOOKUP(A51,座標入力!$B$3:$D$402,3,FALSE))","v":""},"","",""]
[null,null,{"$f":"IF(A52=\"\",\"\",VLOOKUP(A52,座標入力!$B$3:$D$402,2,FALSE))","v":""},{"$f":"IF(A52=\"\",\"\",VLOOKUP(A52,座標入力!$B$3:$D$402,3,FALSE))","v":""},"","",""]
[null,null,{"$f":"IF(A53=\"\",\"\",VLOOKUP(A53,座標入力!$B$3:$D$402,2,FALSE))","v":""},{"$f":"IF(A53=\"\",\"\",VLOOKUP(A53,座標入力!$B$3:$D$402,3,FALSE))","v":""},"","",""]
[null,null,{"$f":"IF(A54=\"\",\"\",VLOOKUP(A54,座標入力!$B$3:$D$402,2,FALSE))","v":""},{"$f":"IF(A54=\"\",\"\",VLOOKUP(A54,座標入力!$B$3:$D$402,3,FALSE))","v":""},"","",""]
[null,null,{"$f":"IF(A55=\"\",\"\",VLOOKUP(A55,座標入力!$B$3:$D$402,2,FALSE))","v":""},{"$f":"IF(A55=\"\",\"\",VLOOKUP(A55,座標入力!$B$3:$D$402,3,FALSE))","v":""},"",{"$f":"IF(C55=\"\",\"\",IF(C56=\"\",$C$8-C54,C56-C54))","v":""},""]
[null,null,{"$f":"IF(A56=\"\",\"\",VLOOKUP(A56,座標入力!$B$3:$D$402,2,FALSE))","v":""},{"$f":"IF(A56=\"\",\"\",VLOOKUP(A56,座標入力!$B$3:$D$402,3,FALSE))","v":""},"","",""]
[null,null,{"$f":"IF(A57=\"\",\"\",VLOOKUP(A57,座標入力!$B$3:$D$402,2,FALSE))","v":""},{"$f":"IF(A57=\"\",\"\",VLOOKUP(A57,座標入力!$B$3:$D$402,3,FALSE))","v":""},{"$f":"IF(C57=\"\",\"\",ROUND(IF(AND(C64=\"\",D64=\"\"),SQRT(($C$8-C57)^2+($D$8-D57)^2),SQRT((C64-C57)^2+(D64-D57)^2)),3))","v":""},{"$f":"IF(C57=\"\",\"\",IF(C64=\"\",$C$8-C56,C64-C56))","v":""},{"$f":"IF(OR(D57=\"\",F57=\"\"),\"\",D57*F57)","v":""}]
["備 考",null,null,null,null,"倍　面　積",{"$f":"IF(OR(I8=0,I9<>0),\"\",SUM(G8:G57))","v":""}]
[null,null,null,null,null,"弐　　　除",{"$f":"IF(G58=\"\",\"\",ABS(G58/2))","v":""}]
[null,null,null,null,{"$f":"IF(G59=\"\",\"\",ROUNDDOWN((G59/3.3057852),2))","v":""},"面　　　積",{"$f":"IF(G1=\"(1/2)\",\"計算結果は２頁目です\",IF(G1=\"(1/3)\",\"計算結果は３頁目です\",(TEXT((I60),\"##0.00 ㎡    \"))))","v":""},null,{"$f":"IF(G59=\"\",\"\",ROUNDDOWN(G59,2))","v":""}]
[{"$f":"座標入力!J3","v":"C04O05K05U00DS1"},null,null,null,null,null,{"$f":"座標入力!J4","v":"座標入力使用者に名前入力"}]
[{"$f":"IF(OR(A64=\"\",$A$6=\"\"),\"\",$A$6)","v":""},null,{"$f":"IF(OR(A64=\"\",$C$6=\"\"),\"\",$C$6)","v":""},null,"座標面積計算簿",null,{"$f":"IF(I9=0,\"\",IF(AND(I8<>0,I9<>0,I10=0),\"(2/2)\",\"(2/3)\"))","v":""}]
["測　　　点",null,"Ｘ","Ｙ","距　　　離","Ｘｎ+1－Ｘｎ-1","Ｙ(Ｘｎ+1－Ｘｎ-1)"]
[null,null,{"$f":"IF(A64=\"\",\"\",VLOOKUP(A64,座標入力!$B$3:$D$402,2,FALSE))","v":""},{"$f":"IF(A64=\"\",\"\",VLOOKUP(A64,座標入力!$B$3:$D$402,3,FALSE))","v":""},{"$f":"IF(C64=\"\",\"\",ROUND(IF(AND(C65=\"\",D65=\"\"),SQRT(($C$8-C64)^2+($D$8-D64)^2),SQRT((C65-C64)^2+(D65-D64)^2)),3))","v":""},{"$f":"IF(A64=\"\",\"\",IF(C65=\"\",$C$8-C57,C65-C57))","v":""},{"$f":"IF(OR(D64=\"\",F64=\"\"),\"\",D64*F64)","v":""}]
[null,null,{"$f":"IF(A65=\"\",\"\",VLOOKUP(A65,座標入力!$B$3:$D$402,2,FALSE))","v":""},{"$f":"IF(A65=\"\",\"\",VLOOKUP(A65,座標入力!$B$3:$D$402,3,FALSE))","v":""},"",{"$f":"IF(C65=\"\",\"\",IF(C66=\"\",$C$8-C64,C66-C64))","v":""},""]
[null,null,{"$f":"IF(A66=\"\",\"\",VLOOKUP(A66,座標入力!$B$3:$D$402,2,FALSE))","v":""},{"$f":"IF(A66=\"\",\"\",VLOOKUP(A66,座標入力!$B$3:$D$402,3,FALSE))","v":""},"",{"$f":"IF(C66=\"\",\"\",IF(C67=\"\",$C$8-C65,C67-C65))","v":""},""]
[null,null,{"$f":"IF(A67=\"\",\"\",VLOOKUP(A67,座標入力!$B$3:$D$402,2,FALSE))","v":""},{"$f":"IF(A67=\"\",\"\",VLOOKUP(A67,座標入力!$B$3:$D$402,3,FALSE))","v":""},"",{"$f":"IF(C67=\"\",\"\",IF(C68=\"\",$C$8-C66,C68-C66))","v":""},""]
[null,null,{"$f":"IF(A68=\"\",\"\",VLOOKUP(A68,座標入力!$B$3:$D$402,2,FALSE))","v":""},{"$f":"IF(A68=\"\",\"\",VLOOKUP(A68,座標入力!$B$3:$D$402,3,FALSE))","v":""},"","",""]
[null,null,{"$f":"IF(A69=\"\",\"\",VLOOKUP(A69,座標入力!$B$3:$D$402,2,FALSE))","v":""},{"$f":"IF(A69=\"\",\"\",VLOOKUP(A69,座標入力!$B$3:$D$402,3,FALSE))","v":""},"","",""]
[null,null,{"$f":"IF(A70=\"\",\"\",VLOOKUP(A70,座標入力!$B$3:$D$402,2,FALSE))","v":""},{"$f":"IF(A70=\"\",\"\",VLOOKUP(A70,座標入力!$B$3:$D$402,3,FALSE))","v":""},"","",""]
[null,null,{"$f":"IF(A71=\"\",\"\",VLOOKUP(A71,座標入力!$B$3:$D$402,2,FALSE))","v":""},{"$f":"IF(A71=\"\",\"\",VLOOKUP(A71,座標入力!$B$3:$D$402,3,FALSE))","v":""},"","",""]
[null,null,{"$f":"IF(A72=\"\",\"\",VLOOKUP(A72,座標入力!$B$3:$D$402,2,FALSE))","v":""},{"$f":"IF(A72=\"\",\"\",VLOOKUP(A72,座標入力!$B$3:$D$402,3,FALSE))","v":""},"","",""]
[null,null,{"$f":"IF(A73=\"\",\"\",VLOOKUP(A73,座標入力!$B$3:$D$402,2,FALSE))","v":""},{"$f":"IF(A73=\"\",\"\",VLOOKUP(A73,座標入力!$B$3:$D$402,3,FALSE))","v":""},"","",""]
[null,null,{"$f":"IF(A74=\"\",\"\",VLOOKUP(A74,座標入力!$B$3:$D$402,2,FALSE))","v":""},{"$f":"IF(A74=\"\",\"\",VLOOKUP(A74,座標入力!$B$3:$D$402,3,FALSE))","v":""},"","",""]
[null,null,{"$f":"IF(A75=\"\",\"\",VLOOKUP(A75,座標入力!$B$3:$D$402,2,FALSE))","v":""},{"$f":"IF(A75=\"\",\"\",VLOOKUP(A75,座標入力!$B$3:$D$402,3,FALSE))","v":""},"","",""]
[null,null,{"$f":"IF(A76=\"\",\"\",VLOOKUP(A76,座標入力!$B$3:$D$402,2,FALSE))","v":""},{"$f":"IF(A76=\"\",\"\",VLOOKUP(A76,座標入力!$B$3:$D$402,3,FALSE))","v":""},"","",""]
[null,null,{"$f":"IF(A77=\"\",\"\",VLOOKUP(A77,座標入力!$B$3:$D$402,2,FALSE))","v":""},{"$f":"IF(A77=\"\",\"\",VLOOKUP(A77,座標入力!$B$3:$D$402,3,FALSE))","v":""},"","",""]
[null,null,{"$f":"IF(A78=\"\",\"\",VLOOKUP(A78,座標入力!$B$3:$D$402,2,FALSE))","v":""},{"$f":"IF(A78=\"\",\"\",VLOOKUP(A78,座標入力!$B$3:$D$402,3,FALSE))","v":""},"","",""]
[null,null,{"$f":"IF(A79=\"\",\"\",VLOOKUP(A79,座標入力!$B$3:$D$402,2,FALSE))","v":""},{"$f":"IF(A79=\"\",\"\",VLOOKUP(A79,座標入力!$B$3:$D$402,3,FALSE))","v":""},"","",""]
[null,null,{"$f":"IF(A80=\"\",\"\",VLOOKUP(A80,座標入力!$B$3:$D$402,2,FALSE))","v":""},{"$f":"IF(A80=\"\",\"\",VLOOKUP(A80,座標入力!$B$3:$D$402,3,FALSE))","v":""},"","",""]
[null,null,{"$f":"IF(A81=\"\",\"\",VLOOKUP(A81,座標入力!$B$3:$D$402,2,FALSE))","v":""},{"$f":"IF(A81=\"\",\"\",VLOOKUP(A81,座標入力!$B$3:$D$402,3,FALSE))","v":""},"",{"$f":"IF(C81=\"\",\"\",IF(C82=\"\",$C$8-C80,C82-C80))","v":""},""]
[null,null,{"$f":"IF(A82=\"\",\"\",VLOOKUP(A82,座標入力!$B$3:$D$402,2,FALSE))","v":""},{"$f":"IF(A82=\"\",\"\",VLOOKUP(A82,座標入力!$B$3:$D$402,3,FALSE))","v":""},"","",""]
[null,null,{"$f":"IF(A83=\"\",\"\",VLOOKUP(A83,座標入力!$B$3:$D$402,2,FALSE))","v":""},{"$f":"IF(A83=\"\",\"\",VLOOKUP(A83,座標入力!$B$3:$D$402,3,FALSE))","v":""},"","",""]
[null,null,{"$f":"IF(A84=\"\",\"\",VLOOKUP(A84,座標入力!$B$3:$D$402,2,FALSE))","v":""},{"$f":"IF(A84=\"\",\"\",VLOOKUP(A84,座標入力!$B$3:$D$402,3,FALSE))","v":""},"","",""]
[null,null,{"$f":"IF(A85=\"\",\"\",VLOOKUP(A85,座標入力!$B$3:$D$402,2,FALSE))","v":""},{"$f":"IF(A85=\"\",\"\",VLOOKUP(A85,座標入力!$B$3:$D$402,3,FALSE))","v":""},"","",""]
[null,null,{"$f":"IF(A86=\"\",\"\",VLOOKUP(A86,座標入力!$B$3:$D$402,2,FALSE))","v":""},{"$f":"IF(A86=\"\",\"\",VLOOKUP(A86,座標入力!$B$3:$D$402,3,FALSE))","v":""},"","",""]
[null,null,{"$f":"IF(A87=\"\",\"\",VLOOKUP(A87,座標入力!$B$3:$D$402,2,FALSE))","v":""},{"$f":"IF(A87=\"\",\"\",VLOOKUP(A87,座標入力!$B$3:$D$402,3,FALSE))","v":""},"","",""]
[null,null,{"$f":"IF(A88=\"\",\"\",VLOOKUP(A88,座標入力!$B$3:$D$402,2,FALSE))","v":""},{"$f":"IF(A88=\"\",\"\",VLOOKUP(A88,座標入力!$B$3:$D$402,3,FALSE))","v":""},"","",""]
[null,null,{"$f":"IF(A89=\"\",\"\",VLOOKUP(A89,座標入力!$B$3:$D$402,2,FALSE))","v":""},{"$f":"IF(A89=\"\",\"\",VLOOKUP(A89,座標入力!$B$3:$D$402,3,FALSE))","v":""},"","",""]
[null,null,{"$f":"IF(A90=\"\",\"\",VLOOKUP(A90,座標入力!$B$3:$D$402,2,FALSE))","v":""},{"$f":"IF(A90=\"\",\"\",VLOOKUP(A90,座標入力!$B$3:$D$402,3,FALSE))","v":""},"","",""]
[null,null,{"$f":"IF(A91=\"\",\"\",VLOOKUP(A91,座標入力!$B$3:$D$402,2,FALSE))","v":""},{"$f":"IF(A91=\"\",\"\",VLOOKUP(A91,座標入力!$B$3:$D$402,3,FALSE))","v":""},"","",""]
[null,null,{"$f":"IF(A92=\"\",\"\",VLOOKUP(A92,座標入力!$B$3:$D$402,2,FALSE))","v":""},{"$f":"IF(A92=\"\",\"\",VLOOKUP(A92,座標入力!$B$3:$D$402,3,FALSE))","v":""},"","",""]
[null,null,{"$f":"IF(A93=\"\",\"\",VLOOKUP(A93,座標入力!$B$3:$D$402,2,FALSE))","v":""},{"$f":"IF(A93=\"\",\"\",VLOOKUP(A93,座標入力!$B$3:$D$402,3,FALSE))","v":""},"","",""]
[null,null,{"$f":"IF(A94=\"\",\"\",VLOOKUP(A94,座標入力!$B$3:$D$402,2,FALSE))","v":""},{"$f":"IF(A94=\"\",\"\",VLOOKUP(A94,座標入力!$B$3:$D$402,3,FALSE))","v":""},{"$f":"IF(C94=\"\",\"\",ROUND(IF(AND(C95=\"\",D95=\"\"),SQRT(($C$8-C94)^2+($D$8-D94)^2),SQRT((C95-C94)^2+(D95-D94)^2)),3))","v":""},"",""]
[null,null,{"$f":"IF(A95=\"\",\"\",VLOOKUP(A95,座標入力!$B$3:$D$402,2,FALSE))","v":""},{"$f":"IF(A95=\"\",\"\",VLOOKUP(A95,座標入力!$B$3:$D$402,3,FALSE))","v":""},{"$f":"IF(C95=\"\",\"\",ROUND(IF(AND(C96=\"\",D96=\"\"),SQRT(($C$8-C95)^2+($D$8-D95)^2),SQRT((C96-C95)^2+(D96-D95)^2)),3))","v":""},"",""]
[null,null,{"$f":"IF(A96=\"\",\"\",VLOOKUP(A96,座標入力!$B$3:$D$402,2,FALSE))","v":""},{"$f":"IF(A96=\"\",\"\",VLOOKUP(A96,座標入力!$B$3:$D$402,3,FALSE))","v":""},"","",""]
[null,null,{"$f":"IF(A97=\"\",\"\",VLOOKUP(A97,座標入力!$B$3:$D$402,2,FALSE))","v":""},{"$f":"IF(A97=\"\",\"\",VLOOKUP(A97,座標入力!$B$3:$D$402,3,FALSE))","v":""},"","",""]
[null,null,{"$f":"IF(A98=\"\",\"\",VLOOKUP(A98,座標入力!$B$3:$D$402,2,FALSE))","v":""},{"$f":"IF(A98=\"\",\"\",VLOOKUP(A98,座標入力!$B$3:$D$402,3,FALSE))","v":""},"","",""]
[null,null,{"$f":"IF(A99=\"\",\"\",VLOOKUP(A99,座標入力!$B$3:$D$402,2,FALSE))","v":""},{"$f":"IF(A99=\"\",\"\",VLOOKUP(A99,座標入力!$B$3:$D$402,3,FALSE))","v":""},"","",""]
[null,null,{"$f":"IF(A100=\"\",\"\",VLOOKUP(A100,座標入力!$B$3:$D$402,2,FALSE))","v":""},{"$f":"IF(A100=\"\",\"\",VLOOKUP(A100,座標入力!$B$3:$D$402,3,FALSE))","v":""},"","",""]
[null,null,{"$f":"IF(A101=\"\",\"\",VLOOKUP(A101,座標入力!$B$3:$D$402,2,FALSE))","v":""},{"$f":"IF(A101=\"\",\"\",VLOOKUP(A101,座標入力!$B$3:$D$402,3,FALSE))","v":""},"","",""]
[null,null,{"$f":"IF(A102=\"\",\"\",VLOOKUP(A102,座標入力!$B$3:$D$402,2,FALSE))","v":""},{"$f":"IF(A102=\"\",\"\",VLOOKUP(A102,座標入力!$B$3:$D$402,3,FALSE))","v":""},"","",""]
[null,null,{"$f":"IF(A103=\"\",\"\",VLOOKUP(A103,座標入力!$B$3:$D$402,2,FALSE))","v":""},{"$f":"IF(A103=\"\",\"\",VLOOKUP(A103,座標入力!$B$3:$D$402,3,FALSE))","v":""},"","",""]
[null,null,{"$f":"IF(A104=\"\",\"\",VLOOKUP(A104,座標入力!$B$3:$D$402,2,FALSE))","v":""},{"$f":"IF(A104=\"\",\"\",VLOOKUP(A104,座標入力!$B$3:$D$402,3,FALSE))","v":""},"","",""]
[null,null,{"$f":"IF(A105=\"\",\"\",VLOOKUP(A105,座標入力!$B$3:$D$402,2,FALSE))","v":""},{"$f":"IF(A105=\"\",\"\",VLOOKUP(A105,座標入力!$B$3:$D$402,3,FALSE))","v":""},"","",""]
[null,null,{"$f":"IF(A106=\"\",\"\",VLOOKUP(A106,座標入力!$B$3:$D$402,2,FALSE))","v":""},{"$f":"IF(A106=\"\",\"\",VLOOKUP(A106,座標入力!$B$3:$D$402,3,FALSE))","v":""},"","",""]
[null,null,{"$f":"IF(A107=\"\",\"\",VLOOKUP(A107,座標入力!$B$3:$D$402,2,FALSE))","v":""},{"$f":"IF(A107=\"\",\"\",VLOOKUP(A107,座標入力!$B$3:$D$402,3,FALSE))","v":""},"","",""]
[null,null,{"$f":"IF(A108=\"\",\"\",VLOOKUP(A108,座標入力!$B$3:$D$402,2,FALSE))","v":""},{"$f":"IF(A108=\"\",\"\",VLOOKUP(A108,座標入力!$B$3:$D$402,3,FALSE))","v":""},"","",""]
[null,null,{"$f":"IF(A109=\"\",\"\",VLOOKUP(A109,座標入力!$B$3:$D$402,2,FALSE))","v":""},{"$f":"IF(A109=\"\",\"\",VLOOKUP(A109,座標入力!$B$3:$D$402,3,FALSE))","v":""},"","",""]
[null,null,{"$f":"IF(A110=\"\",\"\",VLOOKUP(A110,座標入力!$B$3:$D$402,2,FALSE))","v":""},{"$f":"IF(A110=\"\",\"\",VLOOKUP(A110,座標入力!$B$3:$D$402,3,FALSE))","v":""},{"$f":"IF(C110=\"\",\"\",ROUND(IF(AND(C111=\"\",D111=\"\"),SQRT(($C$8-C110)^2+($D$8-D110)^2),SQRT((C111-C110)^2+(D111-D110)^2)),3))","v":""},"",""]
[null,null,{"$f":"IF(A111=\"\",\"\",VLOOKUP(A111,座標入力!$B$3:$D$402,2,FALSE))","v":""},{"$f":"IF(A111=\"\",\"\",VLOOKUP(A111,座標入力!$B$3:$D$402,3,FALSE))","v":""},{"$f":"IF(C111=\"\",\"\",ROUND(IF(AND(C112=\"\",D112=\"\"),SQRT(($C$8-C111)^2+($D$8-D111)^2),SQRT((C112-C111)^2+(D112-D111)^2)),3))","v":""},"",""]
[null,null,{"$f":"IF(A112=\"\",\"\",VLOOKUP(A112,座標入力!$B$3:$D$402,2,FALSE))","v":""},{"$f":"IF(A112=\"\",\"\",VLOOKUP(A112,座標入力!$B$3:$D$402,3,FALSE))","v":""},"","",""]
[null,null,{"$f":"IF(A113=\"\",\"\",VLOOKUP(A113,座標入力!$B$3:$D$402,2,FALSE))","v":""},{"$f":"IF(A113=\"\",\"\",VLOOKUP(A113,座標入力!$B$3:$D$402,3,FALSE))","v":""},"","",""]
[null,null,{"$f":"IF(A114=\"\",\"\",VLOOKUP(A114,座標入力!$B$3:$D$402,2,FALSE))","v":""},{"$f":"IF(A114=\"\",\"\",VLOOKUP(A114,座標入力!$B$3:$D$402,3,FALSE))","v":""},"","",""]
[null,null,{"$f":"IF(A115=\"\",\"\",VLOOKUP(A115,座標入力!$B$3:$D$402,2,FALSE))","v":""},{"$f":"IF(A115=\"\",\"\",VLOOKUP(A115,座標入力!$B$3:$D$402,3,FALSE))","v":""},"","",""]
[null,null,{"$f":"IF(A116=\"\",\"\",VLOOKUP(A116,座標入力!$B$3:$D$402,2,FALSE))","v":""},{"$f":"IF(A116=\"\",\"\",VLOOKUP(A116,座標入力!$B$3:$D$402,3,FALSE))","v":""},"","",""]
[null,null,{"$f":"IF(A117=\"\",\"\",VLOOKUP(A117,座標入力!$B$3:$D$402,2,FALSE))","v":""},{"$f":"IF(A117=\"\",\"\",VLOOKUP(A117,座標入力!$B$3:$D$402,3,FALSE))","v":""},"",{"$f":"IF(C117=\"\",\"\",IF(C118=\"\",$C$8-C116,C118-C116))","v":""},""]
[null,null,{"$f":"IF(A118=\"\",\"\",VLOOKUP(A118,座標入力!$B$3:$D$402,2,FALSE))","v":""},{"$f":"IF(A118=\"\",\"\",VLOOKUP(A118,座標入力!$B$3:$D$402,3,FALSE))","v":""},"","",""]
[null,null,{"$f":"IF(A119=\"\",\"\",VLOOKUP(A119,座標入力!$B$3:$D$402,2,FALSE))","v":""},{"$f":"IF(A119=\"\",\"\",VLOOKUP(A119,座標入力!$B$3:$D$402,3,FALSE))","v":""},{"$f":"IF(C119=\"\",\"\",ROUND(IF(AND(C126=\"\",D126=\"\"),SQRT(($C$8-C119)^2+($D$8-D119)^2),SQRT((C126-C119)^2+(D126-D119)^2)),3))","v":""},{"$f":"IF(C119=\"\",\"\",IF(C126=\"\",$C$8-C118,C126-C118))","v":""},{"$f":"IF(OR(D119=\"\",F119=\"\"),\"\",D119*F119)","v":""}]
["備 考",null,null,null,null,"倍　面　積",{"$f":"IF(OR(I9=0,I10<>0),\"\",SUM(G8:G57,G64:G119))","v":""}]
[null,null,null,null,null,"弐　　　除",{"$f":"IF(G120=\"\",\"\",ABS(G120/2))","v":""}]
[null,null,null,null,{"$f":"IF(G121=\"\",\"\",ROUNDDOWN((G121/3.3057852),2))","v":""},"面　　　積",{"$f":"IF(AND(I122=\"\",G1=\"(1/3)\"),\"計算結果は３頁目です\",TEXT((I122),\"##0.00 ㎡    \"))","v":""},null,{"$f":"IF(G121=\"\",\"\",ROUNDDOWN(G121,2))","v":""}]
[{"$f":"A61","v":"C04O05K05U00DS1"},null,null,null,null,null,{"$f":"座標入力!$J$4","v":"座標入力使用者に名前入力"}]
[{"$f":"IF(OR(A126=\"\",$A$6=\"\"),\"\",$A$6)","v":""},null,{"$f":"IF(OR(A126=\"\",$C$6=\"\"),\"\",$C$6)","v":""},null,"座標面積計算簿",null,{"$f":"IF(I10=0,\"\",\"(3/3)\")","v":""}]
["測　　　点",null,"Ｘ","Ｙ","距　　　離","Ｘｎ+1－Ｘｎ-1","Ｙ(Ｘｎ+1－Ｘｎ-1)"]
[null,null,{"$f":"IF(A126=\"\",\"\",VLOOKUP(A126,座標入力!$B$3:$D$402,2,FALSE))","v":""},{"$f":"IF(A126=\"\",\"\",VLOOKUP(A126,座標入力!$B$3:$D$402,3,FALSE))","v":""},{"$f":"IF(C126=\"\",\"\",ROUND(IF(AND(C127=\"\",D127=\"\"),SQRT(($C$8-C126)^2+($D$8-D126)^2),SQRT((C127-C126)^2+(D127-D126)^2)),3))","v":""},{"$f":"IF(A126=\"\",\"\",IF(C127=\"\",$C$8-C119,C127-C119))","v":""},{"$f":"IF(OR(D126=\"\",F126=\"\"),\"\",D126*F126)","v":""}]
[null,null,{"$f":"IF(A127=\"\",\"\",VLOOKUP(A127,座標入力!$B$3:$D$402,2,FALSE))","v":""},{"$f":"IF(A127=\"\",\"\",VLOOKUP(A127,座標入力!$B$3:$D$402,3,FALSE))","v":""},{"$f":"IF(C127=\"\",\"\",ROUND(IF(AND(C128=\"\",D128=\"\"),SQRT(($C$8-C127)^2+($D$8-D127)^2),SQRT((C128-C127)^2+(D128-D127)^2)),3))","v":""},{"$f":"IF(C127=\"\",\"\",IF(C128=\"\",$C$8-C126,C128-C126))","v":""},{"$f":"IF(OR(D127=\"\",F127=\"\"),\"\",D127*F127)","v":""}]
[null,null,{"$f":"IF(A128=\"\",\"\",VLOOKUP(A128,座標入力!$B$3:$D$402,2,FALSE))","v":""},{"$f":"IF(A128=\"\",\"\",VLOOKUP(A128,座標入力!$B$3:$D$402,3,FALSE))","v":""},"",{"$f":"IF(C128=\"\",\"\",IF(C129=\"\",$C$8-C127,C129-C127))","v":""},""]
[null,null,{"$f":"IF(A129=\"\",\"\",VLOOKUP(A129,座標入力!$B$3:$D$402,2,FALSE))","v":""},{"$f":"IF(A129=\"\",\"\",VLOOKUP(A129,座標入力!$B$3:$D$402,3,FALSE))","v":""},"","",""]
[null,null,{"$f":"IF(A130=\"\",\"\",VLOOKUP(A130,座標入力!$B$3:$D$402,2,FALSE))","v":""},{"$f":"IF(A130=\"\",\"\",VLOOKUP(A130,座標入力!$B$3:$D$402,3,FALSE))","v":""},"","",""]
[null,null,{"$f":"IF(A131=\"\",\"\",VLOOKUP(A131,座標入力!$B$3:$D$402,2,FALSE))","v":""},{"$f":"IF(A131=\"\",\"\",VLOOKUP(A131,座標入力!$B$3:$D$402,3,FALSE))","v":""},"","",""]
[null,null,{"$f":"IF(A132=\"\",\"\",VLOOKUP(A132,座標入力!$B$3:$D$402,2,FALSE))","v":""},{"$f":"IF(A132=\"\",\"\",VLOOKUP(A132,座標入力!$B$3:$D$402,3,FALSE))","v":""},"","",""]
[null,null,{"$f":"IF(A133=\"\",\"\",VLOOKUP(A133,座標入力!$B$3:$D$402,2,FALSE))","v":""},{"$f":"IF(A133=\"\",\"\",VLOOKUP(A133,座標入力!$B$3:$D$402,3,FALSE))","v":""},"","",""]
[null,null,{"$f":"IF(A134=\"\",\"\",VLOOKUP(A134,座標入力!$B$3:$D$402,2,FALSE))","v":""},{"$f":"IF(A134=\"\",\"\",VLOOKUP(A134,座標入力!$B$3:$D$402,3,FALSE))","v":""},"","",""]
[null,null,{"$f":"IF(A135=\"\",\"\",VLOOKUP(A135,座標入力!$B$3:$D$402,2,FALSE))","v":""},{"$f":"IF(A135=\"\",\"\",VLOOKUP(A135,座標入力!$B$3:$D$402,3,FALSE))","v":""},"","",""]
[null,null,{"$f":"IF(A136=\"\",\"\",VLOOKUP(A136,座標入力!$B$3:$D$402,2,FALSE))","v":""},{"$f":"IF(A136=\"\",\"\",VLOOKUP(A136,座標入力!$B$3:$D$402,3,FALSE))","v":""},"","",""]
[null,null,{"$f":"IF(A137=\"\",\"\",VLOOKUP(A137,座標入力!$B$3:$D$402,2,FALSE))","v":""},{"$f":"IF(A137=\"\",\"\",VLOOKUP(A137,座標入力!$B$3:$D$402,3,FALSE))","v":""},"","",""]
[null,null,{"$f":"IF(A138=\"\",\"\",VLOOKUP(A138,座標入力!$B$3:$D$402,2,FALSE))","v":""},{"$f":"IF(A138=\"\",\"\",VLOOKUP(A138,座標入力!$B$3:$D$402,3,FALSE))","v":""},"","",""]
[null,null,{"$f":"IF(A139=\"\",\"\",VLOOKUP(A139,座標入力!$B$3:$D$402,2,FALSE))","v":""},{"$f":"IF(A139=\"\",\"\",VLOOKUP(A139,座標入力!$B$3:$D$402,3,FALSE))","v":""},"","",""]
[null,null,{"$f":"IF(A140=\"\",\"\",VLOOKUP(A140,座標入力!$B$3:$D$402,2,FALSE))","v":""},{"$f":"IF(A140=\"\",\"\",VLOOKUP(A140,座標入力!$B$3:$D$402,3,FALSE))","v":""},"","",""]
[null,null,{"$f":"IF(A141=\"\",\"\",VLOOKUP(A141,座標入力!$B$3:$D$402,2,FALSE))","v":""},{"$f":"IF(A141=\"\",\"\",VLOOKUP(A141,座標入力!$B$3:$D$402,3,FALSE))","v":""},"","",""]
[null,null,{"$f":"IF(A142=\"\",\"\",VLOOKUP(A142,座標入力!$B$3:$D$402,2,FALSE))","v":""},{"$f":"IF(A142=\"\",\"\",VLOOKUP(A142,座標入力!$B$3:$D$402,3,FALSE))","v":""},"","",""]
[null,null,{"$f":"IF(A143=\"\",\"\",VLOOKUP(A143,座標入力!$B$3:$D$402,2,FALSE))","v":""},{"$f":"IF(A143=\"\",\"\",VLOOKUP(A143,座標入力!$B$3:$D$402,3,FALSE))","v":""},"","",""]
[null,null,{"$f":"IF(A144=\"\",\"\",VLOOKUP(A144,座標入力!$B$3:$D$402,2,FALSE))","v":""},{"$f":"IF(A144=\"\",\"\",VLOOKUP(A144,座標入力!$B$3:$D$402,3,FALSE))","v":""},"","",""]
[null,null,{"$f":"IF(A145=\"\",\"\",VLOOKUP(A145,座標入力!$B$3:$D$402,2,FALSE))","v":""},{"$f":"IF(A145=\"\",\"\",VLOOKUP(A145,座標入力!$B$3:$D$402,3,FALSE))","v":""},"","",""]
[null,null,{"$f":"IF(A146=\"\",\"\",VLOOKUP(A146,座標入力!$B$3:$D$402,2,FALSE))","v":""},{"$f":"IF(A146=\"\",\"\",VLOOKUP(A146,座標入力!$B$3:$D$402,3,FALSE))","v":""},"","",""]
[null,null,{"$f":"IF(A147=\"\",\"\",VLOOKUP(A147,座標入力!$B$3:$D$402,2,FALSE))","v":""},{"$f":"IF(A147=\"\",\"\",VLOOKUP(A147,座標入力!$B$3:$D$402,3,FALSE))","v":""},"","",""]
[null,null,{"$f":"IF(A148=\"\",\"\",VLOOKUP(A148,座標入力!$B$3:$D$402,2,FALSE))","v":""},{"$f":"IF(A148=\"\",\"\",VLOOKUP(A148,座標入力!$B$3:$D$402,3,FALSE))","v":""},"","",""]
[null,null,{"$f":"IF(A149=\"\",\"\",VLOOKUP(A149,座標入力!$B$3:$D$402,2,FALSE))","v":""},{"$f":"IF(A149=\"\",\"\",VLOOKUP(A149,座標入力!$B$3:$D$402,3,FALSE))","v":""},"","",""]
[null,null,{"$f":"IF(A150=\"\",\"\",VLOOKUP(A150,座標入力!$B$3:$D$402,2,FALSE))","v":""},{"$f":"IF(A150=\"\",\"\",VLOOKUP(A150,座標入力!$B$3:$D$402,3,FALSE))","v":""},"","",""]
[null,null,{"$f":"IF(A151=\"\",\"\",VLOOKUP(A151,座標入力!$B$3:$D$402,2,FALSE))","v":""},{"$f":"IF(A151=\"\",\"\",VLOOKUP(A151,座標入力!$B$3:$D$402,3,FALSE))","v":""},"","",""]
[null,null,{"$f":"IF(A152=\"\",\"\",VLOOKUP(A152,座標入力!$B$3:$D$402,2,FALSE))","v":""},{"$f":"IF(A152=\"\",\"\",VLOOKUP(A152,座標入力!$B$3:$D$402,3,FALSE))","v":""},"","",""]
[null,null,{"$f":"IF(A153=\"\",\"\",VLOOKUP(A153,座標入力!$B$3:$D$402,2,FALSE))","v":""},{"$f":"IF(A153=\"\",\"\",VLOOKUP(A153,座標入力!$B$3:$D$402,3,FALSE))","v":""},"","",""]
[null,null,{"$f":"IF(A154=\"\",\"\",VLOOKUP(A154,座標入力!$B$3:$D$402,2,FALSE))","v":""},{"$f":"IF(A154=\"\",\"\",VLOOKUP(A154,座標入力!$B$3:$D$402,3,FALSE))","v":""},"","",""]
[null,null,{"$f":"IF(A155=\"\",\"\",VLOOKUP(A155,座標入力!$B$3:$D$402,2,FALSE))","v":""},{"$f":"IF(A155=\"\",\"\",VLOOKUP(A155,座標入力!$B$3:$D$402,3,FALSE))","v":""},"","",""]
[null,null,{"$f":"IF(A156=\"\",\"\",VLOOKUP(A156,座標入力!$B$3:$D$402,2,FALSE))","v":""},{"$f":"IF(A156=\"\",\"\",VLOOKUP(A156,座標入力!$B$3:$D$402,3,FALSE))","v":""},"","",""]
[null,null,{"$f":"IF(A157=\"\",\"\",VLOOKUP(A157,座標入力!$B$3:$D$402,2,FALSE))","v":""},{"$f":"IF(A157=\"\",\"\",VLOOKUP(A157,座標入力!$B$3:$D$402,3,FALSE))","v":""},"","",""]
[null,null,{"$f":"IF(A158=\"\",\"\",VLOOKUP(A158,座標入力!$B$3:$D$402,2,FALSE))","v":""},{"$f":"IF(A158=\"\",\"\",VLOOKUP(A158,座標入力!$B$3:$D$402,3,FALSE))","v":""},"","",""]
[null,null,{"$f":"IF(A159=\"\",\"\",VLOOKUP(A159,座標入力!$B$3:$D$402,2,FALSE))","v":""},{"$f":"IF(A159=\"\",\"\",VLOOKUP(A159,座標入力!$B$3:$D$402,3,FALSE))","v":""},"","",""]
[null,null,{"$f":"IF(A160=\"\",\"\",VLOOKUP(A160,座標入力!$B$3:$D$402,2,FALSE))","v":""},{"$f":"IF(A160=\"\",\"\",VLOOKUP(A160,座標入力!$B$3:$D$402,3,FALSE))","v":""},"","",""]
[null,null,{"$f":"IF(A161=\"\",\"\",VLOOKUP(A161,座標入力!$B$3:$D$402,2,FALSE))","v":""},{"$f":"IF(A161=\"\",\"\",VLOOKUP(A161,座標入力!$B$3:$D$402,3,FALSE))","v":""},"","",""]
[null,null,{"$f":"IF(A162=\"\",\"\",VLOOKUP(A162,座標入力!$B$3:$D$402,2,FALSE))","v":""},{"$f":"IF(A162=\"\",\"\",VLOOKUP(A162,座標入力!$B$3:$D$402,3,FALSE))","v":""},"","",""]
[null,null,{"$f":"IF(A163=\"\",\"\",VLOOKUP(A163,座標入力!$B$3:$D$402,2,FALSE))","v":""},{"$f":"IF(A163=\"\",\"\",VLOOKUP(A163,座標入力!$B$3:$D$402,3,FALSE))","v":""},"","",""]
[null,null,{"$f":"IF(A164=\"\",\"\",VLOOKUP(A164,座標入力!$B$3:$D$402,2,FALSE))","v":""},{"$f":"IF(A164=\"\",\"\",VLOOKUP(A164,座標入力!$B$3:$D$402,3,FALSE))","v":""},"","",""]
[null,null,{"$f":"IF(A165=\"\",\"\",VLOOKUP(A165,座標入力!$B$3:$D$402,2,FALSE))","v":""},{"$f":"IF(A165=\"\",\"\",VLOOKUP(A165,座標入力!$B$3:$D$402,3,FALSE))","v":""},"","",""]
[null,null,{"$f":"IF(A166=\"\",\"\",VLOOKUP(A166,座標入力!$B$3:$D$402,2,FALSE))","v":""},{"$f":"IF(A166=\"\",\"\",VLOOKUP(A166,座標入力!$B$3:$D$402,3,FALSE))","v":""},"","",""]
[null,null,{"$f":"IF(A167=\"\",\"\",VLOOKUP(A167,座標入力!$B$3:$D$402,2,FALSE))","v":""},{"$f":"IF(A167=\"\",\"\",VLOOKUP(A167,座標入力!$B$3:$D$402,3,FALSE))","v":""},"","",""]
[null,null,{"$f":"IF(A168=\"\",\"\",VLOOKUP(A168,座標入力!$B$3:$D$402,2,FALSE))","v":""},{"$f":"IF(A168=\"\",\"\",VLOOKUP(A168,座標入力!$B$3:$D$402,3,FALSE))","v":""},{"$f":"IF(C168=\"\",\"\",ROUND(IF(AND(C169=\"\",D169=\"\"),SQRT(($C$8-C168)^2+($D$8-D168)^2),SQRT((C169-C168)^2+(D169-D168)^2)),3))","v":""},"",""]
[null,null,{"$f":"IF(A169=\"\",\"\",VLOOKUP(A169,座標入力!$B$3:$D$402,2,FALSE))","v":""},{"$f":"IF(A169=\"\",\"\",VLOOKUP(A169,座標入力!$B$3:$D$402,3,FALSE))","v":""},"","",""]
[null,null,{"$f":"IF(A170=\"\",\"\",VLOOKUP(A170,座標入力!$B$3:$D$402,2,FALSE))","v":""},{"$f":"IF(A170=\"\",\"\",VLOOKUP(A170,座標入力!$B$3:$D$402,3,FALSE))","v":""},"","",""]
[null,null,{"$f":"IF(A171=\"\",\"\",VLOOKUP(A171,座標入力!$B$3:$D$402,2,FALSE))","v":""},{"$f":"IF(A171=\"\",\"\",VLOOKUP(A171,座標入力!$B$3:$D$402,3,FALSE))","v":""},"","",""]
[null,null,{"$f":"IF(A172=\"\",\"\",VLOOKUP(A172,座標入力!$B$3:$D$402,2,FALSE))","v":""},{"$f":"IF(A172=\"\",\"\",VLOOKUP(A172,座標入力!$B$3:$D$402,3,FALSE))","v":""},"","",""]
[null,null,{"$f":"IF(A173=\"\",\"\",VLOOKUP(A173,座標入力!$B$3:$D$402,2,FALSE))","v":""},{"$f":"IF(A173=\"\",\"\",VLOOKUP(A173,座標入力!$B$3:$D$402,3,FALSE))","v":""},"","",""]
[null,null,{"$f":"IF(A174=\"\",\"\",VLOOKUP(A174,座標入力!$B$3:$D$402,2,FALSE))","v":""},{"$f":"IF(A174=\"\",\"\",VLOOKUP(A174,座標入力!$B$3:$D$402,3,FALSE))","v":""},"","",""]
[null,null,{"$f":"IF(A175=\"\",\"\",VLOOKUP(A175,座標入力!$B$3:$D$402,2,FALSE))","v":""},{"$f":"IF(A175=\"\",\"\",VLOOKUP(A175,座標入力!$B$3:$D$402,3,FALSE))","v":""},"","",""]
[null,null,{"$f":"IF(A176=\"\",\"\",VLOOKUP(A176,座標入力!$B$3:$D$402,2,FALSE))","v":""},{"$f":"IF(A176=\"\",\"\",VLOOKUP(A176,座標入力!$B$3:$D$402,3,FALSE))","v":""},"","",""]
[null,null,{"$f":"IF(A177=\"\",\"\",VLOOKUP(A177,座標入力!$B$3:$D$402,2,FALSE))","v":""},{"$f":"IF(A177=\"\",\"\",VLOOKUP(A177,座標入力!$B$3:$D$402,3,FALSE))","v":""},"","",""]
[null,null,{"$f":"IF(A178=\"\",\"\",VLOOKUP(A178,座標入力!$B$3:$D$402,2,FALSE))","v":""},{"$f":"IF(A178=\"\",\"\",VLOOKUP(A178,座標入力!$B$3:$D$402,3,FALSE))","v":""},"","",""]
[null,null,{"$f":"IF(A179=\"\",\"\",VLOOKUP(A179,座標入力!$B$3:$D$402,2,FALSE))","v":""},{"$f":"IF(A179=\"\",\"\",VLOOKUP(A179,座標入力!$B$3:$D$402,3,FALSE))","v":""},"","",""]
[null,null,{"$f":"IF(A180=\"\",\"\",VLOOKUP(A180,座標入力!$B$3:$D$402,2,FALSE))","v":""},{"$f":"IF(A180=\"\",\"\",VLOOKUP(A180,座標入力!$B$3:$D$402,3,FALSE))","v":""},"","",""]
[null,null,null,null,{"$f":"IF(C181=\"\",\"\",ROUND(SQRT(($C$8-C181)^2+($D$8-D181)^2),3))","v":""},{"$f":"IF(C181=\"\",\"\",$C$8-C180)","v":""},""]
["備 考",null,null,null,null,"倍　面　積",{"$f":"IF(I10=0,\"\",SUM(G8:G57,G64:G119,G126:G181))","v":""}]
[null,null,null,null,null,"弐　　　除",{"$f":"IF(G182=\"\",\"\",ABS(G182/2))","v":""}]
[null,null,null,null,{"$f":"IF(G183=\"\",\"\",ROUNDDOWN((G183/3.3057852),2))","v":""},"面　　　積",{"$f":"IF(I184=\"\",\"\",TEXT((I184),\"##0.00㎡    \"))","v":""},null,{"$f":"IF(G183=\"\",\"\",ROUNDDOWN(G183,2))","v":""}]
[{"$f":"A61","v":"C04O05K05U00DS1"},null,null,null,null,null,{"$f":"座標入力!$J$4","v":"座標入力使用者に名前入力"}]

{"sheet":"2点間距離","index":2,"n_rows":55,"n_cols":11,"rows_kept":55,"cut":false,"hidden":false,"merged":[[0,0,0,2],[2,12,2,13],[3,12,3,13],[1,1,1,3]]}
["２点間距離計算書"]
[{"$f":"面積計算!A2","v":"件名："},{"$f":"面積計算!B2","v":"福岡市○○区△△町１丁目地内道路測量"}]
["2003-05-06",null,null,"博多花子"]
["測点１","測点２","２点間距離","備　考",null,"測1のX","測1のY","測2のX","測2のY","Ｘの差","Ｙの差"]
[null,null,{"$f":"IF(OR(A5=\"\",B5=\"\"),\"\",SQRT(J5+K5))","v":""},null,null,{"$f":"IF(A5=\"\",\"\",VLOOKUP(A5,座標入力!$B$3:$D$402,2,FALSE))","v":""},{"$f":"IF(A5=\"\",\"\",VLOOKUP(A5,座標入力!$B$3:$D$402,3,FALSE))","v":""},{"$f":"IF(B5=\"\",\"\",VLOOKUP(B5,座標入力!$B$3:$D$402,2,FALSE))","v":""},{"$f":"IF(B5=\"\",\"\",VLOOKUP(B5,座標入力!$B$3:$D$402,3,FALSE))","v":""},{"$f":"IF(OR(F5=\"\",H5=\"\"),\"\",(F5-H5)^2)","v":""},{"$f":"IF(OR(G5=\"\",I5=\"\"),\"\",(G5-I5)^2)","v":""}]
[null,null,{"$f":"IF(OR(A6=\"\",B6=\"\"),\"\",SQRT(J6+K6))","v":""},null,null,{"$f":"IF(A6=\"\",\"\",VLOOKUP(A6,座標入力!$B$3:$D$402,2,FALSE))","v":""},{"$f":"IF(A6=\"\",\"\",VLOOKUP(A6,座標入力!$B$3:$D$402,3,FALSE))","v":""},{"$f":"IF(B6=\"\",\"\",VLOOKUP(B6,座標入力!$B$3:$D$402,2,FALSE))","v":""},{"$f":"IF(B6=\"\",\"\",VLOOKUP(B6,座標入力!$B$3:$D$402,3,FALSE))","v":""},{"$f":"IF(OR(F6=\"\",H6=\"\"),\"\",(F6-H6)^2)","v":""},{"$f":"IF(OR(G6=\"\",I6=\"\"),\"\",(G6-I6)^2)","v":""}]
[null,null,"",null,null,{"$f":"IF(A7=\"\",\"\",VLOOKUP(A7,座標入力!$B$3:$D$402,2,FALSE))","v":""},{"$f":"IF(A7=\"\",\"\",VLOOKUP(A7,座標入力!$B$3:$D$402,3,FALSE))","v":""},{"$f":"IF(B7=\"\",\"\",VLOOKUP(B7,座標入力!$B$3:$D$402,2,FALSE))","v":""},{"$f":"IF(B7=\"\",\"\",VLOOKUP(B7,座標入力!$B$3:$D$402,3,FALSE))","v":""},"",""]
[null,null,"",null,null,{"$f":"IF(A8=\"\",\"\",VLOOKUP(A8,座標入力!$B$3:$D$402,2,FALSE))","v":""},{"$f":"IF(A8=\"\",\"\",VLOOKUP(A8,座標入力!$B$3:$D$402,3,FALSE))","v":""},{"$f":"IF(B8=\"\",\"\",VLOOKUP(B8,座標入力!$B$3:$D$402,2,FALSE))","v":""},{"$f":"IF(B8=\"\",\"\",VLOOKUP(B8,座標入力!$B$3:$D$402,3,FALSE))","v":""},"",""]
[null,null,"",null,null,{"$f":"IF(A9=\"\",\"\",VLOOKUP(A9,座標入力!$B$3:$D$402,2,FALSE))","v":""},{"$f":"IF(A9=\"\",\"\",VLOOKUP(A9,座標入力!$B$3:$D$402,3,FALSE))","v":""},{"$f":"IF(B9=\"\",\"\",VLOOKUP(B9,座標入力!$B$3:$D$402,2,FALSE))","v":""},{"$f":"IF(B9=\"\",\"\",VLOOKUP(B9,座標入力!$B$3:$D$402,3,FALSE))","v":""},"",""]
[null,null,"",null,null,{"$f":"IF(A10=\"\",\"\",VLOOKUP(A10,座標入力!$B$3:$D$402,2,FALSE))","v":""},{"$f":"IF(A10=\"\",\"\",VLOOKUP(A10,座標入力!$B$3:$D$402,3,FALSE))","v":""},{"$f":"IF(B10=\"\",\"\",VLOOKUP(B10,座標入力!$B$3:$D$402,2,FALSE))","v":""},{"$f":"IF(B10=\"\",\"\",VLOOKUP(B10,座標入力!$B$3:$D$402,3,FALSE))","v":""},"",""]
[null,null,"",null,null,{"$f":"IF(A11=\"\",\"\",VLOOKUP(A11,座標入力!$B$3:$D$402,2,FALSE))","v":""},{"$f":"IF(A11=\"\",\"\",VLOOKUP(A11,座標入力!$B$3:$D$402,3,FALSE))","v":""},{"$f":"IF(B11=\"\",\"\",VLOOKUP(B11,座標入力!$B$3:$D$402,2,FALSE))","v":""},{"$f":"IF(B11=\"\",\"\",VLOOKUP(B11,座標入力!$B$3:$D$402,3,FALSE))","v":""},"",""]
[null,null,"",null,null,{"$f":"IF(A12=\"\",\"\",VLOOKUP(A12,座標入力!$B$3:$D$402,2,FALSE))","v":""},{"$f":"IF(A12=\"\",\"\",VLOOKUP(A12,座標入力!$B$3:$D$402,3,FALSE))","v":""},{"$f":"IF(B12=\"\",\"\",VLOOKUP(B12,座標入力!$B$3:$D$402,2,FALSE))","v":""},{"$f":"IF(B12=\"\",\"\",VLOOKUP(B12,座標入力!$B$3:$D$402,3,FALSE))","v":""},"",""]
[null,null,"",null,null,{"$f":"IF(A13=\"\",\"\",VLOOKUP(A13,座標入力!$B$3:$D$402,2,FALSE))","v":""},{"$f":"IF(A13=\"\",\"\",VLOOKUP(A13,座標入力!$B$3:$D$402,3,FALSE))","v":""},{"$f":"IF(B13=\"\",\"\",VLOOKUP(B13,座標入力!$B$3:$D$402,2,FALSE))","v":""},{"$f":"IF(B13=\"\",\"\",VLOOKUP(B13,座標入力!$B$3:$D$402,3,FALSE))","v":""},"",""]
[null,null,"",null,null,{"$f":"IF(A14=\"\",\"\",VLOOKUP(A14,座標入力!$B$3:$D$402,2,FALSE))","v":""},{"$f":"IF(A14=\"\",\"\",VLOOKUP(A14,座標入力!$B$3:$D$402,3,FALSE))","v":""},{"$f":"IF(B14=\"\",\"\",VLOOKUP(B14,座標入力!$B$3:$D$402,2,FALSE))","v":""},{"$f":"IF(B14=\"\",\"\",VLOOKUP(B14,座標入力!$B$3:$D$402,3,FALSE))","v":""},"",""]
[null,null,"",null,null,{"$f":"IF(A15=\"\",\"\",VLOOKUP(A15,座標入力!$B$3:$D$402,2,FALSE))","v":""},{"$f":"IF(A15=\"\",\"\",VLOOKUP(A15,座標入力!$B$3:$D$402,3,FALSE))","v":""},{"$f":"IF(B15=\"\",\"\",VLOOKUP(B15,座標入力!$B$3:$D$402,2,FALSE))","v":""},{"$f":"IF(B15=\"\",\"\",VLOOKUP(B15,座標入力!$B$3:$D$402,3,FALSE))","v":""},"",""]
[null,null,"",null,null,{"$f":"IF(A16=\"\",\"\",VLOOKUP(A16,座標入力!$B$3:$D$402,2,FALSE))","v":""},{"$f":"IF(A16=\"\",\"\",VLOOKUP(A16,座標入力!$B$3:$D$402,3,FALSE))","v":""},{"$f":"IF(B16=\"\",\"\",VLOOKUP(B16,座標入力!$B$3:$D$402,2,FALSE))","v":""},{"$f":"IF(B16=\"\",\"\",VLOOKUP(B16,座標入力!$B$3:$D$402,3,FALSE))","v":""},"",""]
[null,null,"",null,null,{"$f":"IF(A17=\"\",\"\",VLOOKUP(A17,座標入力!$B$3:$D$402,2,FALSE))","v":""},{"$f":"IF(A17=\"\",\"\",VLOOKUP(A17,座標入力!$B$3:$D$402,3,FALSE))","v":""},{"$f":"IF(B17=\"\",\"\",VLOOKUP(B17,座標入力!$B$3:$D$402,2,FALSE))","v":""},{"$f":"IF(B17=\"\",\"\",VLOOKUP(B17,座標入力!$B$3:$D$402,3,FALSE))","v":""},"",""]
[null,null,"",null,null,{"$f":"IF(A18=\"\",\"\",VLOOKUP(A18,座標入力!$B$3:$D$402,2,FALSE))","v":""},{"$f":"IF(A18=\"\",\"\",VLOOKUP(A18,座標入力!$B$3:$D$402,3,FALSE))","v":""},{"$f":"IF(B18=\"\",\"\",VLOOKUP(B18,座標入力!$B$3:$D$402,2,FALSE))","v":""},{"$f":"IF(B18=\"\",\"\",VLOOKUP(B18,座標入力!$B$3:$D$402,3,FALSE))","v":""},"",""]
[null,null,"",null,null,{"$f":"IF(A19=\"\",\"\",VLOOKUP(A19,座標入力!$B$3:$D$402,2,FALSE))","v":""},{"$f":"IF(A19=\"\",\"\",VLOOKUP(A19,座標入力!$B$3:$D$402,3,FALSE))","v":""},{"$f":"IF(B19=\"\",\"\",VLOOKUP(B19,座標入力!$B$3:$D$402,2,FALSE))","v":""},{"$f":"IF(B19=\"\",\"\",VLOOKUP(B19,座標入力!$B$3:$D$402,3,FALSE))","v":""},"",""]
[null,null,{"$f":"IF(OR(A20=\"\",B20=\"\"),\"\",SQRT(J20+K20))","v":""},null,null,{"$f":"IF(A20=\"\",\"\",VLOOKUP(A20,座標入力!$B$3:$D$402,2,FALSE))","v":""},{"$f":"IF(A20=\"\",\"\",VLOOKUP(A20,座標入力!$B$3:$D$402,3,FALSE))","v":""},{"$f":"IF(B20=\"\",\"\",VLOOKUP(B20,座標入力!$B$3:$D$402,2,FALSE))","v":""},{"$f":"IF(B20=\"\",\"\",VLOOKUP(B20,座標入力!$B$3:$D$402,3,FALSE))","v":""},{"$f":"IF(OR(F20=\"\",H20=\"\"),\"\",(F20-H20)^2)","v":""},{"$f":"IF(OR(G20=\"\",I20=\"\"),\"\",(G20-I20)^2)","v":""}]
[null,null,"",null,null,{"$f":"IF(A21=\"\",\"\",VLOOKUP(A21,座標入力!$B$3:$D$402,2,FALSE))","v":""},{"$f":"IF(A21=\"\",\"\",VLOOKUP(A21,座標入力!$B$3:$D$402,3,FALSE))","v":""},{"$f":"IF(B21=\"\",\"\",VLOOKUP(B21,座標入力!$B$3:$D$402,2,FALSE))","v":""},{"$f":"IF(B21=\"\",\"\",VLOOKUP(B21,座標入力!$B$3:$D$402,3,FALSE))","v":""},"",""]
[null,null,"",null,null,{"$f":"IF(A22=\"\",\"\",VLOOKUP(A22,座標入力!$B$3:$D$402,2,FALSE))","v":""},{"$f":"IF(A22=\"\",\"\",VLOOKUP(A22,座標入力!$B$3:$D$402,3,FALSE))","v":""},{"$f":"IF(B22=\"\",\"\",VLOOKUP(B22,座標入力!$B$3:$D$402,2,FALSE))","v":""},{"$f":"IF(B22=\"\",\"\",VLOOKUP(B22,座標入力!$B$3:$D$402,3,FALSE))","v":""},"",""]
[null,null,"",null,null,{"$f":"IF(A23=\"\",\"\",VLOOKUP(A23,座標入力!$B$3:$D$402,2,FALSE))","v":""},{"$f":"IF(A23=\"\",\"\",VLOOKUP(A23,座標入力!$B$3:$D$402,3,FALSE))","v":""},{"$f":"IF(B23=\"\",\"\",VLOOKUP(B23,座標入力!$B$3:$D$402,2,FALSE))","v":""},{"$f":"IF(B23=\"\",\"\",VLOOKUP(B23,座標入力!$B$3:$D$402,3,FALSE))","v":""},"",""]
[null,null,"",null,null,{"$f":"IF(A24=\"\",\"\",VLOOKUP(A24,座標入力!$B$3:$D$402,2,FALSE))","v":""},{"$f":"IF(A24=\"\",\"\",VLOOKUP(A24,座標入力!$B$3:$D$402,3,FALSE))","v":""},{"$f":"IF(B24=\"\",\"\",VLOOKUP(B24,座標入力!$B$3:$D$402,2,FALSE))","v":""},{"$f":"IF(B24=\"\",\"\",VLOOKUP(B24,座標入力!$B$3:$D$402,3,FALSE))","v":""},"",""]
[null,null,"",null,null,{"$f":"IF(A25=\"\",\"\",VLOOKUP(A25,座標入力!$B$3:$D$402,2,FALSE))","v":""},{"$f":"IF(A25=\"\",\"\",VLOOKUP(A25,座標入力!$B$3:$D$402,3,FALSE))","v":""},{"$f":"IF(B25=\"\",\"\",VLOOKUP(B25,座標入力!$B$3:$D$402,2,FALSE))","v":""},{"$f":"IF(B25=\"\",\"\",VLOOKUP(B25,座標入力!$B$3:$D$402,3,FALSE))","v":""},"",""]
[null,null,"",null,null,{"$f":"IF(A26=\"\",\"\",VLOOKUP(A26,座標入力!$B$3:$D$402,2,FALSE))","v":""},{"$f":"IF(A26=\"\",\"\",VLOOKUP(A26,座標入力!$B$3:$D$402,3,FALSE))","v":""},{"$f":"IF(B26=\"\",\"\",VLOOKUP(B26,座標入力!$B$3:$D$402,2,FALSE))","v":""},{"$f":"IF(B26=\"\",\"\",VLOOKUP(B26,座標入力!$B$3:$D$402,3,FALSE))","v":""},"",""]
[null,null,"",null,null,{"$f":"IF(A27=\"\",\"\",VLOOKUP(A27,座標入力!$B$3:$D$402,2,FALSE))","v":""},{"$f":"IF(A27=\"\",\"\",VLOOKUP(A27,座標入力!$B$3:$D$402,3,FALSE))","v":""},{"$f":"IF(B27=\"\",\"\",VLOOKUP(B27,座標入力!$B$3:$D$402,2,FALSE))","v":""},{"$f":"IF(B27=\"\",\"\",VLOOKUP(B27,座標入力!$B$3:$D$402,3,FALSE))","v":""},"",""]
[null,null,"",null,null,{"$f":"IF(A28=\"\",\"\",VLOOKUP(A28,座標入力!$B$3:$D$402,2,FALSE))","v":""},{"$f":"IF(A28=\"\",\"\",VLOOKUP(A28,座標入力!$B$3:$D$402,3,FALSE))","v":""},{"$f":"IF(B28=\"\",\"\",VLOOKUP(B28,座標入力!$B$3:$D$402,2,FALSE))","v":""},{"$f":"IF(B28=\"\",\"\",VLOOKUP(B28,座標入力!$B$3:$D$402,3,FALSE))","v":""},"",""]
[null,null,"",null,null,{"$f":"IF(A29=\"\",\"\",VLOOKUP(A29,座標入力!$B$3:$D$402,2,FALSE))","v":""},{"$f":"IF(A29=\"\",\"\",VLOOKUP(A29,座標入力!$B$3:$D$402,3,FALSE))","v":""},{"$f":"IF(B29=\"\",\"\",VLOOKUP(B29,座標入力!$B$3:$D$402,2,FALSE))","v":""},{"$f":"IF(B29=\"\",\"\",VLOOKUP(B29,座標入力!$B$3:$D$402,3,FALSE))","v":""},"",""]
[null,null,"",null,null,{"$f":"IF(A30=\"\",\"\",VLOOKUP(A30,座標入力!$B$3:$D$402,2,FALSE))","v":""},{"$f":"IF(A30=\"\",\"\",VLOOKUP(A30,座標入力!$B$3:$D$402,3,FALSE))","v":""},{"$f":"IF(B30=\"\",\"\",VLOOKUP(B30,座標入力!$B$3:$D$402,2,FALSE))","v":""},{"$f":"IF(B30=\"\",\"\",VLOOKUP(B30,座標入力!$B$3:$D$402,3,FALSE))","v":""},"",""]
[null,null,"",null,null,{"$f":"IF(A31=\"\",\"\",VLOOKUP(A31,座標入力!$B$3:$D$402,2,FALSE))","v":""},{"$f":"IF(A31=\"\",\"\",VLOOKUP(A31,座標入力!$B$3:$D$402,3,FALSE))","v":""},{"$f":"IF(B31=\"\",\"\",VLOOKUP(B31,座標入力!$B$3:$D$402,2,FALSE))","v":""},{"$f":"IF(B31=\"\",\"\",VLOOKUP(B31,座標入力!$B$3:$D$402,3,FALSE))","v":""},"",""]
[null,null,"",null,null,{"$f":"IF(A32=\"\",\"\",VLOOKUP(A32,座標入力!$B$3:$D$402,2,FALSE))","v":""},{"$f":"IF(A32=\"\",\"\",VLOOKUP(A32,座標入力!$B$3:$D$402,3,FALSE))","v":""},{"$f":"IF(B32=\"\",\"\",VLOOKUP(B32,座標入力!$B$3:$D$402,2,FALSE))","v":""},{"$f":"IF(B32=\"\",\"\",VLOOKUP(B32,座標入力!$B$3:$D$402,3,FALSE))","v":""},"",""]
[null,null,"",null,null,{"$f":"IF(A33=\"\",\"\",VLOOKUP(A33,座標入力!$B$3:$D$402,2,FALSE))","v":""},{"$f":"IF(A33=\"\",\"\",VLOOKUP(A33,座標入力!$B$3:$D$402,3,FALSE))","v":""},{"$f":"IF(B33=\"\",\"\",VLOOKUP(B33,座標入力!$B$3:$D$402,2,FALSE))","v":""},{"$f":"IF(B33=\"\",\"\",VLOOKUP(B33,座標入力!$B$3:$D$402,3,FALSE))","v":""},"",""]
[null,null,"",null,null,{"$f":"IF(A34=\"\",\"\",VLOOKUP(A34,座標入力!$B$3:$D$402,2,FALSE))","v":""},{"$f":"IF(A34=\"\",\"\",VLOOKUP(A34,座標入力!$B$3:$D$402,3,FALSE))","v":""},{"$f":"IF(B34=\"\",\"\",VLOOKUP(B34,座標入力!$B$3:$D$402,2,FALSE))","v":""},{"$f":"IF(B34=\"\",\"\",VLOOKUP(B34,座標入力!$B$3:$D$402,3,FALSE))","v":""},"",""]
[null,null,"",null,null,{"$f":"IF(A35=\"\",\"\",VLOOKUP(A35,座標入力!$B$3:$D$402,2,FALSE))","v":""},{"$f":"IF(A35=\"\",\"\",VLOOKUP(A35,座標入力!$B$3:$D$402,3,FALSE))","v":""},{"$f":"IF(B35=\"\",\"\",VLOOKUP(B35,座標入力!$B$3:$D$402,2,FALSE))","v":""},{"$f":"IF(B35=\"\",\"\",VLOOKUP(B35,座標入力!$B$3:$D$402,3,FALSE))","v":""},"",""]
[null,null,"",null,null,{"$f":"IF(A36=\"\",\"\",VLOOKUP(A36,座標入力!$B$3:$D$402,2,FALSE))","v":""},{"$f":"IF(A36=\"\",\"\",VLOOKUP(A36,座標入力!$B$3:$D$402,3,FALSE))","v":""},{"$f":"IF(B36=\"\",\"\",VLOOKUP(B36,座標入力!$B$3:$D$402,2,FALSE))","v":""},{"$f":"IF(B36=\"\",\"\",VLOOKUP(B36,座標入力!$B$3:$D$402,3,FALSE))","v":""},"",""]
[null,null,"",null,null,{"$f":"IF(A37=\"\",\"\",VLOOKUP(A37,座標入力!$B$3:$D$402,2,FALSE))","v":""},{"$f":"IF(A37=\"\",\"\",VLOOKUP(A37,座標入力!$B$3:$D$402,3,FALSE))","v":""},{"$f":"IF(B37=\"\",\"\",VLOOKUP(B37,座標入力!$B$3:$D$402,2,FALSE))","v":""},{"$f":"IF(B37=\"\",\"\",VLOOKUP(B37,座標入力!$B$3:$D$402,3,FALSE))","v":""},"",""]
[null,null,"",null,null,{"$f":"IF(A38=\"\",\"\",VLOOKUP(A38,座標入力!$B$3:$D$402,2,FALSE))","v":""},{"$f":"IF(A38=\"\",\"\",VLOOKUP(A38,座標入力!$B$3:$D$402,3,FALSE))","v":""},{"$f":"IF(B38=\"\",\"\",VLOOKUP(B38,座標入力!$B$3:$D$402,2,FALSE))","v":""},{"$f":"IF(B38=\"\",\"\",VLOOKUP(B38,座標入力!$B$3:$D$402,3,FALSE))","v":""},"",""]
[null,null,"",null,null,{"$f":"IF(A39=\"\",\"\",VLOOKUP(A39,座標入力!$B$3:$D$402,2,FALSE))","v":""},{"$f":"IF(A39=\"\",\"\",VLOOKUP(A39,座標入力!$B$3:$D$402,3,FALSE))","v":""},{"$f":"IF(B39=\"\",\"\",VLOOKUP(B39,座標入力!$B$3:$D$402,2,FALSE))","v":""},{"$f":"IF(B39=\"\",\"\",VLOOKUP(B39,座標入力!$B$3:$D$402,3,FALSE))","v":""},"",""]
[null,null,"",null,null,{"$f":"IF(A40=\"\",\"\",VLOOKUP(A40,座標入力!$B$3:$D$402,2,FALSE))","v":""},{"$f":"IF(A40=\"\",\"\",VLOOKUP(A40,座標入力!$B$3:$D$402,3,FALSE))","v":""},{"$f":"IF(B40=\"\",\"\",VLOOKUP(B40,座標入力!$B$3:$D$402,2,FALSE))","v":""},{"$f":"IF(B40=\"\",\"\",VLOOKUP(B40,座標入力!$B$3:$D$402,3,FALSE))","v":""},"",""]
[null,null,"",null,null,{"$f":"IF(A41=\"\",\"\",VLOOKUP(A41,座標入力!$B$3:$D$402,2,FALSE))","v":""},{"$f":"IF(A41=\"\",\"\",VLOOKUP(A41,座標入力!$B$3:$D$402,3,FALSE))","v":""},{"$f":"IF(B41=\"\",\"\",VLOOKUP(B41,座標入力!$B$3:$D$402,2,FALSE))","v":""},{"$f":"IF(B41=\"\",\"\",VLOOKUP(B41,座標入力!$B$3:$D$402,3,FALSE))","v":""},"",{"$f":"IF(OR(G41=\"\",I41=\"\"),\"\",(G41-I41)^2)","v":""}]
[null,null,"",null,null,{"$f":"IF(A42=\"\",\"\",VLOOKUP(A42,座標入力!$B$3:$D$402,2,FALSE))","v":""},{"$f":"IF(A42=\"\",\"\",VLOOKUP(A42,座標入力!$B$3:$D$402,3,FALSE))","v":""},{"$f":"IF(B42=\"\",\"\",VLOOKUP(B42,座標入力!$B$3:$D$402,2,FALSE))","v":""},{"$f":"IF(B42=\"\",\"\",VLOOKUP(B42,座標入力!$B$3:$D$402,3,FALSE))","v":""},"",""]
[null,null,"",null,null,{"$f":"IF(A43=\"\",\"\",VLOOKUP(A43,座標入力!$B$3:$D$402,2,FALSE))","v":""},{"$f":"IF(A43=\"\",\"\",VLOOKUP(A43,座標入力!$B$3:$D$402,3,FALSE))","v":""},{"$f":"IF(B43=\"\",\"\",VLOOKUP(B43,座標入力!$B$3:$D$402,2,FALSE))","v":""},{"$f":"IF(B43=\"\",\"\",VLOOKUP(B43,座標入力!$B$3:$D$402,3,FALSE))","v":""},"",""]
[null,null,"",null,null,{"$f":"IF(A44=\"\",\"\",VLOOKUP(A44,座標入力!$B$3:$D$402,2,FALSE))","v":""},{"$f":"IF(A44=\"\",\"\",VLOOKUP(A44,座標入力!$B$3:$D$402,3,FALSE))","v":""},{"$f":"IF(B44=\"\",\"\",VLOOKUP(B44,座標入力!$B$3:$D$402,2,FALSE))","v":""},{"$f":"IF(B44=\"\",\"\",VLOOKUP(B44,座標入力!$B$3:$D$402,3,FALSE))","v":""},"",""]
[null,null,"",null,null,{"$f":"IF(A45=\"\",\"\",VLOOKUP(A45,座標入力!$B$3:$D$402,2,FALSE))","v":""},{"$f":"IF(A45=\"\",\"\",VLOOKUP(A45,座標入力!$B$3:$D$402,3,FALSE))","v":""},{"$f":"IF(B45=\"\",\"\",VLOOKUP(B45,座標入力!$B$3:$D$402,2,FALSE))","v":""},{"$f":"IF(B45=\"\",\"\",VLOOKUP(B45,座標入力!$B$3:$D$402,3,FALSE))","v":""},"",""]
[null,null,"",null,null,{"$f":"IF(A46=\"\",\"\",VLOOKUP(A46,座標入力!$B$3:$D$402,2,FALSE))","v":""},{"$f":"IF(A46=\"\",\"\",VLOOKUP(A46,座標入力!$B$3:$D$402,3,FALSE))","v":""},{"$f":"IF(B46=\"\",\"\",VLOOKUP(B46,座標入力!$B$3:$D$402,2,FALSE))","v":""},{"$f":"IF(B46=\"\",\"\",VLOOKUP(B46,座標入力!$B$3:$D$402,3,FALSE))","v":""},{"$f":"IF(OR(F46=\"\",H46=\"\"),\"\",(F46-H46)^2)","v":""},{"$f":"IF(OR(G46=\"\",I46=\"\"),\"\",(G46-I46)^2)","v":""}]
[null,null,"",null,null,{"$f":"IF(A47=\"\",\"\",VLOOKUP(A47,座標入力!$B$3:$D$402,2,FALSE))","v":""},{"$f":"IF(A47=\"\",\"\",VLOOKUP(A47,座標入力!$B$3:$D$402,3,FALSE))","v":""},{"$f":"IF(B47=\"\",\"\",VLOOKUP(B47,座標入力!$B$3:$D$402,2,FALSE))","v":""},{"$f":"IF(B47=\"\",\"\",VLOOKUP(B47,座標入力!$B$3:$D$402,3,FALSE))","v":""},"",""]
[null,null,"",null,null,{"$f":"IF(A48=\"\",\"\",VLOOKUP(A48,座標入力!$B$3:$D$402,2,FALSE))","v":""},{"$f":"IF(A48=\"\",\"\",VLOOKUP(A48,座標入力!$B$3:$D$402,3,FALSE))","v":""},{"$f":"IF(B48=\"\",\"\",VLOOKUP(B48,座標入力!$B$3:$D$402,2,FALSE))","v":""},{"$f":"IF(B48=\"\",\"\",VLOOKUP(B48,座標入力!$B$3:$D$402,3,FALSE))","v":""},"",""]
[null,null,"",null,null,{"$f":"IF(A49=\"\",\"\",VLOOKUP(A49,座標入力!$B$3:$D$402,2,FALSE))","v":""},{"$f":"IF(A49=\"\",\"\",VLOOKUP(A49,座標入力!$B$3:$D$402,3,FALSE))","v":""},{"$f":"IF(B49=\"\",\"\",VLOOKUP(B49,座標入力!$B$3:$D$402,2,FALSE))","v":""},{"$f":"IF(B49=\"\",\"\",VLOOKUP(B49,座標入力!$B$3:$D$402,3,FALSE))","v":""},"",""]
[null,null,"",null,null,{"$f":"IF(A50=\"\",\"\",VLOOKUP(A50,座標入力!$B$3:$D$402,2,FALSE))","v":""},{"$f":"IF(A50=\"\",\"\",VLOOKUP(A50,座標入力!$B$3:$D$402,3,FALSE))","v":""},{"$f":"IF(B50=\"\",\"\",VLOOKUP(B50,座標入力!$B$3:$D$402,2,FALSE))","v":""},{"$f":"IF(B50=\"\",\"\",VLOOKUP(B50,座標入力!$B$3:$D$402,3,FALSE))","v":""},"",""]
[null,null,"",null,null,{"$f":"IF(A51=\"\",\"\",VLOOKUP(A51,座標入力!$B$3:$D$402,2,FALSE))","v":""},{"$f":"IF(A51=\"\",\"\",VLOOKUP(A51,座標入力!$B$3:$D$402,3,FALSE))","v":""},{"$f":"IF(B51=\"\",\"\",VLOOKUP(B51,座標入力!$B$3:$D$402,2,FALSE))","v":""},{"$f":"IF(B51=\"\",\"\",VLOOKUP(B51,座標入力!$B$3:$D$402,3,FALSE))","v":""},"",""]
[null,null,"",null,null,{"$f":"IF(A52=\"\",\"\",VLOOKUP(A52,座標入力!$B$3:$D$402,2,FALSE))","v":""},{"$f":"IF(A52=\"\",\"\",VLOOKUP(A52,座標入力!$B$3:$D$402,3,FALSE))","v":""},{"$f":"IF(B52=\"\",\"\",VLOOKUP(B52,座標入力!$B$3:$D$402,2,FALSE))","v":""},{"$f":"IF(B52=\"\",\"\",VLOOKUP(B52,座標入力!$B$3:$D$402,3,FALSE))","v":""},{"$f":"IF(OR(F52=\"\",H52=\"\"),\"\",(F52-H52)^2)","v":""},""]
[null,null,{"$f":"IF(OR(A53=\"\",B53=\"\"),\"\",SQRT(J53+K53))","v":""},null,null,{"$f":"IF(A53=\"\",\"\",VLOOKUP(A53,座標入力!$B$3:$D$402,2,FALSE))","v":""},{"$f":"IF(A53=\"\",\"\",VLOOKUP(A53,座標入力!$B$3:$D$402,3,FALSE))","v":""},{"$f":"IF(B53=\"\",\"\",VLOOKUP(B53,座標入力!$B$3:$D$402,2,FALSE))","v":""},{"$f":"IF(B53=\"\",\"\",VLOOKUP(B53,座標入力!$B$3:$D$402,3,FALSE))","v":""},"",""]
[null,null,{"$f":"IF(OR(A54=\"\",B54=\"\"),\"\",SQRT(J54+K54))","v":""},null,null,{"$f":"IF(A54=\"\",\"\",VLOOKUP(A54,座標入力!$B$3:$D$402,2,FALSE))","v":""},{"$f":"IF(A54=\"\",\"\",VLOOKUP(A54,座標入力!$B$3:$D$402,3,FALSE))","v":""},{"$f":"IF(B54=\"\",\"\",VLOOKUP(B54,座標入力!$B$3:$D$402,2,FALSE))","v":""},{"$f":"IF(B54=\"\",\"\",VLOOKUP(B54,座標入力!$B$3:$D$402,3,FALSE))","v":""},"",""]
[{"$f":"面積計算!A61","v":"C04O05K05U00DS1"},null,null,{"$f":"面積計算!G61","v":"座標入力使用者に名前入力"}]

{"sheet":"逆計算","index":3,"n_rows":45,"n_cols":28,"rows_kept":45,"cut":false,"hidden":false,"merged":[[4,29,4,30],[0,0,0,4],[2,0,2,2],[3,0,3,1],[1,1,1,4],[3,29,3,30],[44,1,44,2],[31,0,31,1],[17,0,17,1],[16,1,16,2],[30,1,30,2]]}
["復元(放射逆トラバース)計算書"]
[{"$f":"面積計算!A2","v":"件名："},{"$f":"面積計算!B2","v":"福岡市○○区△△町１丁目地内道路測量"}]
["2003-05-20",null,null,null,"博多花子"]
["測     点",null,"方 向 角","夾　角","距　離",null,"Ｘ","Ｙ"]
["器械点",null,"-","-","-",null,{"$f":"IF(B5=\"\",\"\",VLOOKUP(B5,座標入力!$B$3:$D$402,2,FALSE))","v":""},{"$f":"IF(B5=\"\",\"\",VLOOKUP(B5,座標入力!$B$3:$D$402,3,FALSE))","v":""},"⊿Ｘ","⊿Ｙ","角度1","角度2","度",null,null,"分",null,null,"秒",null,null,"度",null,null,"分",null,null,"分"]
["零方向",null,{"$f":"TEXT(M6,\"#,##0-\")&TEXT(P6,\"#00-\")&TEXT(S6,\"#00\")","v":""},{"$f":"TEXT(V6,\"#,##0-\")&TEXT(Y6,\"#00-\")&TEXT(AB6,\"#00\")","v":""},{"$f":"IF(OR(I6=\"\",J6=\"\"),\"\",SQRT(I6^2+J6^2))","v":""},null,{"$f":"IF(B6=\"\",\"\",VLOOKUP(B6,座標入力!$B$3:$D$402,2,FALSE))","v":""},{"$f":"IF(B6=\"\",\"\",VLOOKUP(B6,座標入力!$B$3:$D$402,3,FALSE))","v":""},{"$f":"IF(OR($G$5=\"\",G6=\"\"),\"\",G6-$G$5)","v":""},{"$f":"IF(OR($H$5=\"\",H6=\"\"),\"\",H6-$H$5)","v":""},{"$f":"IF(OR(I6=\"\",J6=\"\"),\"\",ATAN2(I6,J6)*(180/PI()))","v":""},{"$f":"IF(K6=\"\",\"\",(IF(K6<0,360+K6,K6)))","v":""},{"$f":"IF(L6=\"\",\"\",TRUNC(L6))","v":""},{"$f":"IF(M6=\"\",\"\",L6-M6)","v":""},{"$f":"IF(N6=\"\",\"\",N6*60)","v":""},{"$f":"IF(O6=\"\",\"\",TRUNC(O6))","v":""},{"$f":"IF(P6=\"\",\"\",O6-P6)","v":""},{"$f":"IF(Q6=\"\",\"\",Q6*60)","v":""},{"$f":"IF(R6=\"\",\"\",TRUNC(R6))","v":""},{"$f":"IF(L6=\"\",\"\",L6-$L$6)","v":""},{"$f":"IF(T6=\"\",\"\",T6)","v":""},{"$f":"IF(U6=\"\",\"\",TRUNC(U6))","v":""},{"$f":"IF(V6=\"\",\"\",U6-V6)","v":""},{"$f":"IF(W6=\"\",\"\",W6*60)","v":""},{"$f":"IF(X6=\"\",\"\",TRUNC(X6))","v":""},{"$f":"IF(Y6=\"\",\"\",X6-Y6)","v":""},{"$f":"IF(Z6=\"\",\"\",Z6*60)","v":""},{"$f":"IF(AA6=\"\",\"\",TRUNC(AA6))","v":""}]
["復元 1",null,"",{"$f":"TEXT(V7,\"#,##0-\")&TEXT(Y7,\"#00-\")&TEXT(AB7,\"#00\")","v":""},{"$f":"IF(OR(I7=\"\",J7=\"\"),\"\",SQRT(I7^2+J7^2))","v":""},null,{"$f":"IF(B7=\"\",\"\",VLOOKUP(B7,座標入力!$B$3:$D$402,2,FALSE))","v":""},{"$f":"IF(B7=\"\",\"\",VLOOKUP(B7,座標入力!$B$3:$D$402,3,FALSE))","v":""},{"$f":"IF(OR($G$5=\"\",G7=\"\"),\"\",G7-$G$5)","v":""},{"$f":"IF(OR($H$5=\"\",H7=\"\"),\"\",H7-$H$5)","v":""},{"$f":"IF(OR(I7=\"\",J7=\"\"),\"\",ATAN2(I7,J7)*(180/PI()))","v":""},{"$f":"IF(K7=\"\",\"\",(IF(K7<0,360+K7,K7)))","v":""},{"$f":"IF(L7=\"\",\"\",TRUNC(L7))","v":""},{"$f":"IF(M7=\"\",\"\",L7-M7)","v":""},{"$f":"IF(N7=\"\",\"\",N7*60)","v":""},{"$f":"IF(O7=\"\",\"\",TRUNC(O7))","v":""},{"$f":"IF(P7=\"\",\"\",O7-P7)","v":""},{"$f":"IF(Q7=\"\",\"\",Q7*60)","v":""},{"$f":"IF(R7=\"\",\"\",TRUNC(R7))","v":""},"",{"$f":"IF(T7=\"\",\"\",IF(T7<0,(360+T7),T7))","v":""},{"$f":"IF(U7=\"\",\"\",TRUNC(U7))","v":""},{"$f":"IF(V7=\"\",\"\",U7-V7)","v":""},{"$f":"IF(W7=\"\",\"\",W7*60)","v":""},{"$f":"IF(X7=\"\",\"\",TRUNC(X7))","v":""},{"$f":"IF(Y7=\"\",\"\",X7-Y7)","v":""},{"$f":"IF(Z7=\"\",\"\",Z7*60)","v":""},{"$f":"IF(AA7=\"\",\"\",TRUNC(AA7))","v":""}]
["復元 2",null,"","","",null,{"$f":"IF(B8=\"\",\"\",VLOOKUP(B8,座標入力!$B$3:$D$402,2,FALSE))","v":""},{"$f":"IF(B8=\"\",\"\",VLOOKUP(B8,座標入力!$B$3:$D$402,3,FALSE))","v":""},"","","","","","","","","","","","",{"$f":"IF(T8=\"\",\"\",IF(T8<0,(360+T8),T8))","v":""},{"$f":"IF(U8=\"\",\"\",TRUNC(U8))","v":""},{"$f":"IF(V8=\"\",\"\",U8-V8)","v":""},{"$f":"IF(W8=\"\",\"\",W8*60)","v":""},{"$f":"IF(X8=\"\",\"\",TRUNC(X8))","v":""},"",{"$f":"IF(Z8=\"\",\"\",Z8*60)","v":""},""]
["復元 3",null,"","","",null,{"$f":"IF(B9=\"\",\"\",VLOOKUP(B9,座標入力!$B$3:$D$402,2,FALSE))","v":""},{"$f":"IF(B9=\"\",\"\",VLOOKUP(B9,座標入力!$B$3:$D$402,3,FALSE))","v":""},"","","","","","","","","","","","","","","","","","","",""]
["復元 4",null,"","","",null,{"$f":"IF(B10=\"\",\"\",VLOOKUP(B10,座標入力!$B$3:$D$402,2,FALSE))","v":""},{"$f":"IF(B10=\"\",\"\",VLOOKUP(B10,座標入力!$B$3:$D$402,3,FALSE))","v":""},"","","","","","","","","","","","","","","","","","","",""]
["復元 5",null,"","","",null,{"$f":"IF(B11=\"\",\"\",VLOOKUP(B11,座標入力!$B$3:$D$402,2,FALSE))","v":""},{"$f":"IF(B11=\"\",\"\",VLOOKUP(B11,座標入力!$B$3:$D$402,3,FALSE))","v":""},"","","","","","","","","","","","","","","","","","","",""]
["復元 6",null,"","","",null,{"$f":"IF(B12=\"\",\"\",VLOOKUP(B12,座標入力!$B$3:$D$402,2,FALSE))","v":""},{"$f":"IF(B12=\"\",\"\",VLOOKUP(B12,座標入力!$B$3:$D$402,3,FALSE))","v":""},"","","","","","","","",{"$f":"IF(P12=\"\",\"\",O12-P12)","v":""},"","","","","","","","","","",""]
["復元 7",null,"","","",null,{"$f":"IF(B13=\"\",\"\",VLOOKUP(B13,座標入力!$B$3:$D$402,2,FALSE))","v":""},{"$f":"IF(B13=\"\",\"\",VLOOKUP(B13,座標入力!$B$3:$D$402,3,FALSE))","v":""},"","","","","","","","","","","","","","","","","","","",""]
["復元 8",null,"","","",null,{"$f":"IF(B14=\"\",\"\",VLOOKUP(B14,座標入力!$B$3:$D$402,2,FALSE))","v":""},{"$f":"IF(B14=\"\",\"\",VLOOKUP(B14,座標入力!$B$3:$D$402,3,FALSE))","v":""},"","","","","","","","","","","","","","","","","","","",""]
["復元 9",null,"","","",null,{"$f":"IF(B15=\"\",\"\",VLOOKUP(B15,座標入力!$B$3:$D$402,2,FALSE))","v":""},{"$f":"IF(B15=\"\",\"\",VLOOKUP(B15,座標入力!$B$3:$D$402,3,FALSE))","v":""},"","","","","","","","","","","","","","","","","","","",""]
["復元10",null,"","","",null,{"$f":"IF(B16=\"\",\"\",VLOOKUP(B16,座標入力!$B$3:$D$402,2,FALSE))","v":""},{"$f":"IF(B16=\"\",\"\",VLOOKUP(B16,座標入力!$B$3:$D$402,3,FALSE))","v":""},"","","","","","","","","","","","","","","","","","","",""]
[null,"注意：秒(角度)の端数は切捨て。"]
["測     点",null,"方 向 角","夾　角","距　離"]
["器械点",null,"-","-","-",null,{"$f":"IF(B19=\"\",\"\",VLOOKUP(B19,座標入力!$B$3:$D$402,2,FALSE))","v":""},{"$f":"IF(B19=\"\",\"\",VLOOKUP(B19,座標入力!$B$3:$D$402,3,FALSE))","v":""},"⊿Ｘ","⊿Ｙ","角度1"]
["零方向",null,{"$f":"TEXT(M20,\"#,##0-\")&TEXT(P20,\"#00-\")&TEXT(S20,\"#00\")","v":""},{"$f":"TEXT(V20,\"#,##0-\")&TEXT(Y20,\"#00-\")&TEXT(AB20,\"#00\")","v":""},{"$f":"IF(OR(I20=\"\",J20=\"\"),\"\",SQRT(I20^2+J20^2))","v":""},null,{"$f":"IF(B20=\"\",\"\",VLOOKUP(B20,座標入力!$B$3:$D$402,2,FALSE))","v":""},{"$f":"IF(B20=\"\",\"\",VLOOKUP(B20,座標入力!$B$3:$D$402,3,FALSE))","v":""},{"$f":"IF(OR($G$19=\"\",G20=\"\"),\"\",G20-$G$19)","v":""},{"$f":"IF(OR($H$19=\"\",H20=\"\"),\"\",H20-$H$19)","v":""},{"$f":"IF(OR(I20=\"\",J20=\"\"),\"\",ATAN2(I20,J20)*(180/PI()))","v":""},{"$f":"IF(K20=\"\",\"\",(IF(K20<0,360+K20,K20)))","v":""},{"$f":"IF(L20=\"\",\"\",TRUNC(L20))","v":""},{"$f":"IF(M20=\"\",\"\",L20-M20)","v":""},{"$f":"IF(N20=\"\",\"\",N20*60)","v":""},{"$f":"IF(O20=\"\",\"\",TRUNC(O20))","v":""},{"$f":"IF(P20=\"\",\"\",O20-P20)","v":""},{"$f":"IF(Q20=\"\",\"\",Q20*60)","v":""},{"$f":"IF(R20=\"\",\"\",TRUNC(R20))","v":""},{"$f":"IF(L20=\"\",\"\",L20-$L$20)","v":""},{"$f":"IF(T20=\"\",\"\",T20)","v":""},{"$f":"IF(U20=\"\",\"\",TRUNC(U20))","v":""},{"$f":"IF(V20=\"\",\"\",U20-V20)","v":""},{"$f":"IF(W20=\"\",\"\",W20*60)","v":""},{"$f":"IF(X20=\"\",\"\",TRUNC(X20))","v":""},{"$f":"IF(Y20=\"\",\"\",X20-Y20)","v":""},{"$f":"IF(Z20=\"\",\"\",Z20*60)","v":""},{"$f":"IF(AA20=\"\",\"\",TRUNC(AA20))","v":""}]
["復元 1",null,"",{"$f":"TEXT(V21,\"#,##0-\")&TEXT(Y21,\"#00-\")&TEXT(AB21,\"#00\")","v":""},{"$f":"IF(OR(I21=\"\",J21=\"\"),\"\",SQRT(I21^2+J21^2))","v":""},null,{"$f":"IF(B21=\"\",\"\",VLOOKUP(B21,座標入力!$B$3:$D$402,2,FALSE))","v":""},{"$f":"IF(B21=\"\",\"\",VLOOKUP(B21,座標入力!$B$3:$D$402,3,FALSE))","v":""},{"$f":"IF(OR($G$19=\"\",G21=\"\"),\"\",G21-$G$19)","v":""},{"$f":"IF(OR($H$19=\"\",H21=\"\"),\"\",H21-$H$19)","v":""},{"$f":"IF(OR(I21=\"\",J21=\"\"),\"\",ATAN2(I21,J21)*(180/PI()))","v":""},{"$f":"IF(K21=\"\",\"\",(IF(K21<0,360+K21,K21)))","v":""},{"$f":"IF(L21=\"\",\"\",TRUNC(L21))","v":""},{"$f":"IF(M21=\"\",\"\",L21-M21)","v":""},{"$f":"IF(N21=\"\",\"\",N21*60)","v":""},{"$f":"IF(O21=\"\",\"\",TRUNC(O21))","v":""},{"$f":"IF(P21=\"\",\"\",O21-P21)","v":""},{"$f":"IF(Q21=\"\",\"\",Q21*60)","v":""},{"$f":"IF(R21=\"\",\"\",TRUNC(R21))","v":""},{"$f":"IF(L21=\"\",\"\",L21-$L$20)","v":""},{"$f":"IF(T21=\"\",\"\",IF(T21<0,(360+T21),T21))","v":""},{"$f":"IF(U21=\"\",\"\",TRUNC(U21))","v":""},{"$f":"IF(V21=\"\",\"\",U21-V21)","v":""},{"$f":"IF(W21=\"\",\"\",W21*60)","v":""},{"$f":"IF(X21=\"\",\"\",TRUNC(X21))","v":""},"",{"$f":"IF(Z21=\"\",\"\",Z21*60)","v":""},{"$f":"IF(AA21=\"\",\"\",TRUNC(AA21))","v":""}]
["復元 2",null,"","","",null,{"$f":"IF(B22=\"\",\"\",VLOOKUP(B22,座標入力!$B$3:$D$402,2,FALSE))","v":""},{"$f":"IF(B22=\"\",\"\",VLOOKUP(B22,座標入力!$B$3:$D$402,3,FALSE))","v":""},"","","",{"$f":"IF(K22=\"\",\"\",(IF(K22<0,360+K22,K22)))","v":""},"","","","","","","","",{"$f":"IF(T22=\"\",\"\",IF(T22<0,(360+T22),T22))","v":""},{"$f":"IF(U22=\"\",\"\",TRUNC(U22))","v":""},{"$f":"IF(V22=\"\",\"\",U22-V22)","v":""},{"$f":"IF(W22=\"\",\"\",W22*60)","v":""},{"$f":"IF(X22=\"\",\"\",TRUNC(X22))","v":""},"",{"$f":"IF(Z22=\"\",\"\",Z22*60)","v":""},""]
["復元 3",null,"","","",null,{"$f":"IF(B23=\"\",\"\",VLOOKUP(B23,座標入力!$B$3:$D$402,2,FALSE))","v":""},{"$f":"IF(B23=\"\",\"\",VLOOKUP(B23,座標入力!$B$3:$D$402,3,FALSE))","v":""},"","","","","","","","","","","","","","","","","","","",""]
["復元 4",null,"","","",null,{"$f":"IF(B24=\"\",\"\",VLOOKUP(B24,座標入力!$B$3:$D$402,2,FALSE))","v":""},{"$f":"IF(B24=\"\",\"\",VLOOKUP(B24,座標入力!$B$3:$D$402,3,FALSE))","v":""},"","","","","","","","","","","","","","","","","","","",""]
["復元 5",null,"","","",null,{"$f":"IF(B25=\"\",\"\",VLOOKUP(B25,座標入力!$B$3:$D$402,2,FALSE))","v":""},{"$f":"IF(B25=\"\",\"\",VLOOKUP(B25,座標入力!$B$3:$D$402,3,FALSE))","v":""},"","","","","","","","","","","","","","","","","","","",""]
["復元 6",null,"","","",null,{"$f":"IF(B26=\"\",\"\",VLOOKUP(B26,座標入力!$B$3:$D$402,2,FALSE))","v":""},{"$f":"IF(B26=\"\",\"\",VLOOKUP(B26,座標入力!$B$3:$D$402,3,FALSE))","v":""},"","","","","","","","","","","","","","","","","","","",""]
["復元 7",null,"","","",null,{"$f":"IF(B27=\"\",\"\",VLOOKUP(B27,座標入力!$B$3:$D$402,2,FALSE))","v":""},{"$f":"IF(B27=\"\",\"\",VLOOKUP(B27,座標入力!$B$3:$D$402,3,FALSE))","v":""},"","","","","","","","","","","","","","","","","","","",""]
["復元 8",null,"","","",null,{"$f":"IF(B28=\"\",\"\",VLOOKUP(B28,座標入力!$B$3:$D$402,2,FALSE))","v":""},{"$f":"IF(B28=\"\",\"\",VLOOKUP(B28,座標入力!$B$3:$D$402,3,FALSE))","v":""},"","","","","","","","","","","","","","","","","","","",""]
["復元 9",null,"","","",null,{"$f":"IF(B29=\"\",\"\",VLOOKUP(B29,座標入力!$B$3:$D$402,2,FALSE))","v":""},{"$f":"IF(B29=\"\",\"\",VLOOKUP(B29,座標入力!$B$3:$D$402,3,FALSE))","v":""},{"$f":"IF(OR($G$19=\"\",G29=\"\"),\"\",G29-$G$19)","v":""},"","","","","","","","","","","","","","","","","","",""]
["復元10",null,"","","",null,{"$f":"IF(B30=\"\",\"\",VLOOKUP(B30,座標入力!$B$3:$D$402,2,FALSE))","v":""},{"$f":"IF(B30=\"\",\"\",VLOOKUP(B30,座標入力!$B$3:$D$402,3,FALSE))","v":""},"","","","","","","","","","","","","","","","","","","",""]
[null,"注意：秒(角度)の端数は切捨て。"]
["測    点",null,"方 向 角","夾　角","距　離"]
["器械点","CR33","-","-","-",null,{"$f":"IF(B33=\"\",\"\",VLOOKUP(B33,座標入力!$B$3:$D$402,2,FALSE))","v":{"$error":"#N/A"}},{"$f":"IF(B33=\"\",\"\",VLOOKUP(B33,座標入力!$B$3:$D$402,3,FALSE))","v":{"$error":"#N/A"}},"⊿Ｘ","⊿Ｙ","角度1"]
["零方向","CL18",{"$f":"TEXT(M34,\"#,##0-\")&TEXT(P34,\"#00-\")&TEXT(S34,\"#00\")","v":{"$error":"#N/A"}},{"$f":"TEXT(V34,\"#,##0-\")&TEXT(Y34,\"#00-\")&TEXT(AB34,\"#00\")","v":{"$error":"#N/A"}},{"$f":"IF(OR(I34=\"\",J34=\"\"),\"\",SQRT(I34^2+J34^2))","v":{"$error":"#N/A"}},null,{"$f":"IF(B34=\"\",\"\",VLOOKUP(B34,座標入力!$B$3:$D$402,2,FALSE))","v":{"$error":"#N/A"}},{"$f":"IF(B34=\"\",\"\",VLOOKUP(B34,座標入力!$B$3:$D$402,3,FALSE))","v":{"$error":"#N/A"}},{"$f":"IF(OR($G$33=\"\",G34=\"\"),\"\",G34-$G$33)","v":{"$error":"#N/A"}},{"$f":"IF(OR($H$33=\"\",H34=\"\"),\"\",H34-$H$33)","v":{"$error":"#N/A"}},{"$f":"IF(OR(I34=\"\",J34=\"\"),\"\",ATAN2(I34,J34)*(180/PI()))","v":{"$error":"#N/A"}},{"$f":"IF(K34=\"\",\"\",(IF(K34<0,360+K34,K34)))","v":{"$error":"#N/A"}},{"$f":"IF(L34=\"\",\"\",TRUNC(L34))","v":{"$error":"#N/A"}},{"$f":"IF(M34=\"\",\"\",L34-M34)","v":{"$error":"#N/A"}},{"$f":"IF(N34=\"\",\"\",N34*60)","v":{"$error":"#N/A"}},{"$f":"IF(O34=\"\",\"\",TRUNC(O34))","v":{"$error":"#N/A"}},{"$f":"IF(P34=\"\",\"\",O34-P34)","v":{"$error":"#N/A"}},{"$f":"IF(Q34=\"\",\"\",Q34*60)","v":{"$error":"#N/A"}},{"$f":"IF(R34=\"\",\"\",TRUNC(R34))","v":{"$error":"#N/A"}},{"$f":"IF(L34=\"\",\"\",L34-$L$34)","v":{"$error":"#N/A"}},{"$f":"IF(T34=\"\",\"\",T34)","v":{"$error":"#N/A"}},{"$f":"IF(U34=\"\",\"\",TRUNC(U34))","v":{"$error":"#N/A"}},{"$f":"IF(V34=\"\",\"\",U34-V34)","v":{"$error":"#N/A"}},{"$f":"IF(W34=\"\",\"\",W34*60)","v":{"$error":"#N/A"}},{"$f":"IF(X34=\"\",\"\",TRUNC(X34))","v":{"$error":"#N/A"}},{"$f":"IF(Y34=\"\",\"\",X34-Y34)","v":{"$error":"#N/A"}},{"$f":"IF(Z34=\"\",\"\",Z34*60)","v":{"$error":"#N/A"}},{"$f":"IF(AA34=\"\",\"\",TRUNC(AA34))","v":{"$error":"#N/A"}}]
["復元 1","CR11",{"$f":"TEXT(M35,\"#,##0-\")&TEXT(P35,\"#00-\")&TEXT(S35,\"#00\")","v":{"$error":"#N/A"}},{"$f":"TEXT(V35,\"#,##0-\")&TEXT(Y35,\"#00-\")&TEXT(AB35,\"#00\")","v":{"$error":"#N/A"}},{"$f":"IF(OR(I35=\"\",J35=\"\"),\"\",SQRT(I35^2+J35^2))","v":{"$error":"#N/A"}},null,{"$f":"IF(B35=\"\",\"\",VLOOKUP(B35,座標入力!$B$3:$D$402,2,FALSE))","v":{"$error":"#N/A"}},{"$f":"IF(B35=\"\",\"\",VLOOKUP(B35,座標入力!$B$3:$D$402,3,FALSE))","v":{"$error":"#N/A"}},{"$f":"IF(OR($G$33=\"\",G35=\"\"),\"\",G35-$G$33)","v":{"$error":"#N/A"}},{"$f":"IF(OR($H$33=\"\",H35=\"\"),\"\",H35-$H$33)","v":{"$error":"#N/A"}},{"$f":"IF(OR(I35=\"\",J35=\"\"),\"\",ATAN2(I35,J35)*(180/PI()))","v":{"$error":"#N/A"}},{"$f":"IF(K35=\"\",\"\",(IF(K35<0,360+K35,K35)))","v":{"$error":"#N/A"}},{"$f":"IF(L35=\"\",\"\",TRUNC(L35))","v":{"$error":"#N/A"}},{"$f":"IF(M35=\"\",\"\",L35-M35)","v":{"$error":"#N/A"}},{"$f":"IF(N35=\"\",\"\",N35*60)","v":{"$error":"#N/A"}},{"$f":"IF(O35=\"\",\"\",TRUNC(O35))","v":{"$error":"#N/A"}},{"$f":"IF(P35=\"\",\"\",O35-P35)","v":{"$error":"#N/A"}},{"$f":"IF(Q35=\"\",\"\",Q35*60)","v":{"$error":"#N/A"}},{"$f":"IF(R35=\"\",\"\",TRUNC(R35))","v":{"$error":"#N/A"}},{"$f":"IF(L35=\"\",\"\",L35-$L$34)","v":{"$error":"#N/A"}},{"$f":"IF(T35=\"\",\"\",IF(T35<0,(360+T35),T35))","v":{"$error":"#N/A"}},{"$f":"IF(U35=\"\",\"\",TRUNC(U35))","v":{"$error":"#N/A"}},{"$f":"IF(V35=\"\",\"\",U35-V35)","v":{"$error":"#N/A"}},{"$f":"IF(W35=\"\",\"\",W35*60)","v":{"$error":"#N/A"}},{"$f":"IF(X35=\"\",\"\",TRUNC(X35))","v":{"$error":"#N/A"}},{"$error":"#N/A"},{"$f":"IF(Z35=\"\",\"\",Z35*60)","v":{"$error":"#N/A"}},{"$f":"IF(AA35=\"\",\"\",TRUNC(AA35))","v":{"$error":"#N/A"}}]
["復元 2","CR12",{"$error":"#N/A"},{"$f":"TEXT(V36,\"#,##0-\")&TEXT(Y36,\"#00-\")&TEXT(AB36,\"#00\")","v":{"$error":"#N/A"}},{"$error":"#N/A"},null,{"$f":"IF(B36=\"\",\"\",VLOOKUP(B36,座標入力!$B$3:$D$402,2,FALSE))","v":{"$error":"#N/A"}},{"$f":"IF(B36=\"\",\"\",VLOOKUP(B36,座標入力!$B$3:$D$402,3,FALSE))","v":{"$error":"#N/A"}},{"$error":"#N/A"},{"$f":"IF(OR($H$33=\"\",H36=\"\"),\"\",H36-$H$33)","v":{"$error":"#N/A"}},{"$error":"#N/A"},{"$error":"#N/A"},{"$error":"#N/A"},{"$error":"#N/A"},{"$error":"#N/A"},{"$error":"#N/A"},{"$error":"#N/A"},{"$error":"#N/A"},{"$error":"#N/A"},{"$error":"#N/A"},{"$f":"IF(T36=\"\",\"\",IF(T36<0,(360+T36),T36))","v":{"$error":"#N/A"}},{"$f":"IF(U36=\"\",\"\",TRUNC(U36))","v":{"$error":"#N/A"}},{"$f":"IF(V36=\"\",\"\",U36-V36)","v":{"$error":"#N/A"}},{"$f":"IF(W36=\"\",\"\",W36*60)","v":{"$error":"#N/A"}},{"$f":"IF(X36=\"\",\"\",TRUNC(X36))","v":{"$error":"#N/A"}},{"$error":"#N/A"},{"$f":"IF(Z36=\"\",\"\",Z36*60)","v":{"$error":"#N/A"}},{"$error":"#N/A"}]
["復元 3","CR13",{"$error":"#N/A"},{"$error":"#N/A"},{"$error":"#N/A"},null,{"$f":"IF(B37=\"\",\"\",VLOOKUP(B37,座標入力!$B$3:$D$402,2,FALSE))","v":{"$error":"#N/A"}},{"$f":"IF(B37=\"\",\"\",VLOOKUP(B37,座標入力!$B$3:$D$402,3,FALSE))","v":{"$error":"#N/A"}},{"$error":"#N/A"},{"$error":"#N/A"},{"$error":"#N/A"},{"$error":"#N/A"},{"$error":"#N/A"},{"$error":"#N/A"},{"$error":"#N/A"},{"$error":"#N/A"},{"$error":"#N/A"},{"$error":"#N/A"},{"$error":"#N/A"},{"$error":"#N/A"},{"$error":"#N/A"},{"$error":"#N/A"},{"$error":"#N/A"},{"$error":"#N/A"},{"$error":"#N/A"},{"$error":"#N/A"},{"$error":"#N/A"},{"$error":"#N/A"}]
["復元 4","CR14",{"$error":"#N/A"},{"$error":"#N/A"},{"$error":"#N/A"},null,{"$f":"IF(B38=\"\",\"\",VLOOKUP(B38,座標入力!$B$3:$D$402,2,FALSE))","v":{"$error":"#N/A"}},{"$f":"IF(B38=\"\",\"\",VLOOKUP(B38,座標入力!$B$3:$D$402,3,FALSE))","v":{"$error":"#N/A"}},{"$error":"#N/A"},{"$error":"#N/A"},{"$error":"#N/A"},{"$error":"#N/A"},{"$error":"#N/A"},{"$error":"#N/A"},{"$error":"#N/A"},{"$error":"#N/A"},{"$error":"#N/A"},{"$error":"#N/A"},{"$error":"#N/A"},{"$error":"#N/A"},{"$error":"#N/A"},{"$error":"#N/A"},{"$error":"#N/A"},{"$error":"#N/A"},{"$error":"#N/A"},{"$error":"#N/A"},{"$error":"#N/A"},{"$error":"#N/A"}]
["復元 5","CR15",{"$error":"#N/A"},{"$error":"#N/A"},{"$error":"#N/A"},null,{"$f":"IF(B39=\"\",\"\",VLOOKUP(B39,座標入力!$B$3:$D$402,2,FALSE))","v":{"$error":"#N/A"}},{"$f":"IF(B39=\"\",\"\",VLOOKUP(B39,座標入力!$B$3:$D$402,3,FALSE))","v":{"$error":"#N/A"}},{"$error":"#N/A"},{"$error":"#N/A"},{"$error":"#N/A"},{"$error":"#N/A"},{"$error":"#N/A"},{"$error":"#N/A"},{"$error":"#N/A"},{"$error":"#N/A"},{"$error":"#N/A"},{"$error":"#N/A"},{"$error":"#N/A"},{"$error":"#N/A"},{"$error":"#N/A"},{"$error":"#N/A"},{"$error":"#N/A"},{"$error":"#N/A"},{"$error":"#N/A"},{"$error":"#N/A"},{"$error":"#N/A"},{"$error":"#N/A"}]
["復元 6","CR16",{"$error":"#N/A"},{"$error":"#N/A"},{"$error":"#N/A"},null,{"$f":"IF(B40=\"\",\"\",VLOOKUP(B40,座標入力!$B$3:$D$402,2,FALSE))","v":{"$error":"#N/A"}},{"$f":"IF(B40=\"\",\"\",VLOOKUP(B40,座標入力!$B$3:$D$402,3,FALSE))","v":{"$error":"#N/A"}},{"$error":"#N/A"},{"$error":"#N/A"},{"$error":"#N/A"},{"$error":"#N/A"},{"$error":"#N/A"},{"$error":"#N/A"},{"$error":"#N/A"},{"$error":"#N/A"},{"$error":"#N/A"},{"$error":"#N/A"},{"$error":"#N/A"},{"$error":"#N/A"},{"$error":"#N/A"},{"$error":"#N/A"},{"$error":"#N/A"},{"$error":"#N/A"},{"$error":"#N/A"},{"$error":"#N/A"},{"$error":"#N/A"},{"$error":"#N/A"}]
["復元 7","CR17",{"$error":"#N/A"},{"$error":"#N/A"},{"$error":"#N/A"},null,{"$f":"IF(B41=\"\",\"\",VLOOKUP(B41,座標入力!$B$3:$D$402,2,FALSE))","v":{"$error":"#N/A"}},{"$f":"IF(B41=\"\",\"\",VLOOKUP(B41,座標入力!$B$3:$D$402,3,FALSE))","v":{"$error":"#N/A"}},{"$error":"#N/A"},{"$error":"#N/A"},{"$error":"#N/A"},{"$error":"#N/A"},{"$error":"#N/A"},{"$error":"#N/A"},{"$error":"#N/A"},{"$error":"#N/A"},{"$error":"#N/A"},{"$error":"#N/A"},{"$error":"#N/A"},{"$error":"#N/A"},{"$error":"#N/A"},{"$error":"#N/A"},{"$error":"#N/A"},{"$error":"#N/A"},{"$error":"#N/A"},{"$error":"#N/A"},{"$error":"#N/A"},{"$error":"#N/A"}]
["復元 8","CR18",{"$error":"#N/A"},{"$error":"#N/A"},{"$error":"#N/A"},null,{"$f":"IF(B42=\"\",\"\",VLOOKUP(B42,座標入力!$B$3:$D$402,2,FALSE))","v":{"$error":"#N/A"}},{"$f":"IF(B42=\"\",\"\",VLOOKUP(B42,座標入力!$B$3:$D$402,3,FALSE))","v":{"$error":"#N/A"}},{"$error":"#N/A"},{"$error":"#N/A"},{"$error":"#N/A"},{"$error":"#N/A"},{"$error":"#N/A"},{"$error":"#N/A"},{"$error":"#N/A"},{"$error":"#N/A"},{"$error":"#N/A"},{"$error":"#N/A"},{"$error":"#N/A"},{"$error":"#N/A"},{"$error":"#N/A"},{"$error":"#N/A"},{"$error":"#N/A"},{"$error":"#N/A"},{"$error":"#N/A"},{"$error":"#N/A"},{"$error":"#N/A"},{"$error":"#N/A"}]
["復元 9","CR19",{"$error":"#N/A"},{"$error":"#N/A"},{"$error":"#N/A"},null,{"$f":"IF(B43=\"\",\"\",VLOOKUP(B43,座標入力!$B$3:$D$402,2,FALSE))","v":{"$error":"#N/A"}},{"$f":"IF(B43=\"\",\"\",VLOOKUP(B43,座標入力!$B$3:$D$402,3,FALSE))","v":{"$error":"#N/A"}},{"$error":"#N/A"},{"$error":"#N/A"},{"$error":"#N/A"},{"$error":"#N/A"},{"$error":"#N/A"},{"$error":"#N/A"},{"$error":"#N/A"},{"$error":"#N/A"},{"$error":"#N/A"},{"$error":"#N/A"},{"$error":"#N/A"},{"$error":"#N/A"},{"$error":"#N/A"},{"$error":"#N/A"},{"$error":"#N/A"},{"$error":"#N/A"},{"$error":"#N/A"},{"$error":"#N/A"},{"$error":"#N/A"},{"$error":"#N/A"}]
["復元10","CR20",{"$error":"#N/A"},{"$error":"#N/A"},{"$error":"#N/A"},null,{"$f":"IF(B44=\"\",\"\",VLOOKUP(B44,座標入力!$B$3:$D$402,2,FALSE))","v":{"$error":"#N/A"}},{"$f":"IF(B44=\"\",\"\",VLOOKUP(B44,座標入力!$B$3:$D$402,3,FALSE))","v":{"$error":"#N/A"}},{"$error":"#N/A"},{"$error":"#N/A"},{"$error":"#N/A"},{"$error":"#N/A"},{"$error":"#N/A"},{"$error":"#N/A"},{"$error":"#N/A"},{"$error":"#N/A"},{"$error":"#N/A"},{"$error":"#N/A"},{"$error":"#N/A"},{"$error":"#N/A"},{"$error":"#N/A"},{"$error":"#N/A"},{"$error":"#N/A"},{"$error":"#N/A"},{"$error":"#N/A"},{"$error":"#N/A"},{"$error":"#N/A"},{"$error":"#N/A"}]
[{"$f":"面積計算!A61","v":"C04O05K05U00DS1"},"注意：秒(角度)の端数は切捨て。",null,null,{"$f":"面積計算!G61","v":"座標入力使用者に名前入力"}]

{"sheet":"放射トラバース","index":4,"n_rows":111,"n_cols":30,"rows_kept":111,"cut":false,"hidden":false,"merged":[[23,11,23,15],[97,11,97,15],[8,31,8,32],[9,31,9,32],[10,14,10,15],[32,12,32,13],[33,12,33,13],[26,12,26,13],[27,12,27,13],[2,1,2,14],[7,7,7,8],[8,7,8,8],[8,1,8,2],[6,7,6,8],[0,2,0,12],[4,1,4,3],[1,0,1,2],[13,2,13,3],[13,4,13,5],[13,7,13,8],[10,1,10,8],[12,2,12,3],[12,4,12,5],[12,7,12,8],[11,4,11,5],[11,6,11,8],[14,2,14,3],[14,4,14,5],[14,7,14,8],[15,2,15,3],[15,4,15,5],[10,0,11,0],[6,5,6,6],[7,5,7,6],[8,5,8,6],[11,1,11,3],[6,0,6,2],[7,1,7,2],[15,7,15,8],[21,2,21,3],[21,4,21,5],[21,7,21,8],[18,2,18,3],[18,4,18,5],[18,7,18,8],[17,2,17,3],[17,4,17,5],[17,7,17,8],[20,2,20,3],[20,4,20,5],[20,7,20,8],[19,2,19,3],[19,4,19,5],[19,7,19,8],[16,2,16,3],[16,4,16,5],[16,7,16,8],[28,8,28,9],[27,4,27,5],[27,6,27,7],[22,2,22,3],[22,4,22,5],[22,7,22,8],[24,0,24,2],[26,8,26,9],[27,8,27,9],[26,1,26,3],[26,6,26,7],[27,1,27,3],[29,1,29,3],[29,4,29,5],[29,6,29,7],[28,1,28,3],[28,4,28,5],[28,6,28,7],[26,4,26,5],[32,1,32,3],[32,4,32,5],[32,6,32,7],[32,8,32,9],[33,1,33,3],[33,4,33,5],[33,6,33,7],[33,8,33,9],[29,8,29,9],[30,1,30,3],[30,4,30,5],[30,6,30,7],[30,8,30,9],[31,1,31,3],[31,4,31,5],[31,6,31,7],[31,8,31,9],[36,8,36,9],[35,1,35,3],[35,4,35,5],[35,6,35,7],[35,8,35,9],[34,1,34,3],[34,4,34,5],[34,6,34,7],[34,8,34,9],[49,2,49,3],[49,4,49,5],[49,7,49,8],[50,2,50,3],[50,4,50,5],[50,7,50,8],[47,0,48,0],[47,1,47,8],[47,14,47,15],[48,1,48,3],[48,4,48,5],[48,6,48,8],[53,2,53,3],[53,4,53,5],[53,7,53,8],[54,2,54,3],[54,4,54,5],[54,7,54,8],[51,2,51,3],[51,4,51,5],[51,7,51,8],[52,2,52,3],[52,4,52,5],[52,7,52,8],[57,2,57,3],[57,4,57,5],[57,7,57,8],[58,2,58,3],[58,4,58,5],[58,7,58,8],[55,2,55,3],[55,4,55,5],[55,7,55,8],[56,2,56,3],[56,4,56,5],[56,7,56,8],[59,2,59,3],[59,4,59,5],[59,7,59,8],[61,0,61,2],[63,12,63,13],[64,1,64,3],[64,4,64,5],[64,6,64,7],[64,8,64,9],[64,12,64,13],[60,11,60,15],[63,1,63,3],[63,4,63,5],[63,6,63,7],[63,8,63,9],[65,12,65,13],[66,1,66,3],[66,4,66,5],[66,6,66,7],[66,8,66,9],[66,12,66,13],[65,1,65,3],[65,4,65,5],[65,6,65,7],[65,8,65,9],[67,12,67,13],[68,1,68,3],[68,4,68,5],[68,6,68,7],[68,8,68,9],[68,12,68,13],[67,1,67,3],[67,4,67,5],[67,6,67,7],[67,8,67,9],[69,12,69,13],[70,1,70,3],[70,4,70,5],[70,6,70,7],[70,8,70,9],[70,12,70,13],[72,1,72,3],[72,4,72,5],[72,6,72,7],[72,8,72,9],[73,1,73,3],[73,4,73,5],[73,6,73,7],[73,8,73,9],[69,1,69,3],[69,4,69,5],[69,6,69,7],[69,8,69,9],[71,1,71,3],[71,4,71,5],[71,6,71,7],[71,8,71,9],[81,1,81,2],[81,5,81,6],[81,7,81,8],[82,1,82,2],[82,5,82,6],[82,7,82,8],[74,2,74,12],[75,0,75,2],[76,1,76,14],[78,1,78,3],[80,0,80,2],[80,5,80,6],[80,7,80,8],[86,2,86,3],[86,4,86,5],[86,7,86,8],[87,2,87,3],[87,4,87,5],[87,7,87,8],[84,0,85,0],[84,1,84,8],[84,14,84,15],[85,1,85,3],[85,4,85,5],[85,6,85,8],[84,9,84,12],[84,13,85,13],[90,2,90,3],[90,4,90,5],[90,7,90,8],[91,2,91,3],[91,4,91,5],[91,7,91,8],[88,2,88,3],[88,4,88,5],[88,7,88,8],[89,2,89,3],[89,4,89,5],[89,7,89,8],[94,2,94,3],[94,4,94,5],[94,7,94,8],[95,2,95,3],[95,4,95,5],[95,7,95,8],[92,2,92,3],[92,4,92,5],[92,7,92,8],[93,2,93,3],[93,4,93,5],[93,7,93,8],[96,2,96,3],[96,4,96,5],[96,7,96,8],[98,0,98,2],[100,12,100,13],[101,1,101,3],[101,4,101,5],[101,6,101,7],[101,8,101,9],[101,12,101,13],[100,1,100,3],[100,4,100,5],[100,6,100,7],[100,8,100,9],[102,12,102,13],[103,1,103,3],[103,4,103,5],[103,6,103,7],[103,8,103,9],[103,12,103,13],[105,1,105,3],[105,4,105,5],[105,6,105,7],[105,8,105,9],[106,1,106,3],[106,4,106,5],[106,6,106,7],[106,8,106,9],[102,1,102,3],[102,4,102,5],[102,6,102,7],[102,8,102,9],[104,1,104,3],[104,4,104,5],[104,6,104,7],[104,8,104,9],[109,1,109,3],[109,4,109,5],[109,6,109,7],[109,8,109,9],[110,1,110,3],[110,4,110,5],[110,6,110,7],[110,8,110,9],[107,1,107,3],[107,4,107,5],[107,6,107,7],[107,8,107,9],[108,1,108,3],[108,4,108,5],[108,6,108,7],[108,8,108,9],[110,12,110,13],[110,14,110,15],[36,14,36,15],[36,12,36,13],[73,12,73,13],[73,14,73,15],[106,12,106,13],[107,12,107,13],[104,12,104,13],[105,12,105,13],[10,9,10,12],[10,13,11,13],[47,9,47,12],[47,13,48,13],[37,2,37,12],[38,0,38,2],[39,1,39,14],[41,1,41,3],[30,12,30,13],[31,12,31,13],[44,1,44,2],[44,5,44,6],[44,7,44,8],[45,1,45,2],[45,5,45,6],[45,7,45,8],[28,12,28,13],[29,12,29,13],[43,0,43,2],[43,5,43,6],[43,7,43,8],[36,1,36,3],[36,4,36,5],[36,6,36,7]]}
[null,null,"放射トラバース測量"]
["《 観測手簿 》",null,null,{"$f":"IF(OR(B8=\"\",B9=\"\"),\"\",IF(COUNTA(B8:C9)>0,1,0))","v":""},{"$f":"IF(D2=\"\",\"\",SUM(D2,D39,D76))","v":""},null,null,null,null,null,null,null,null,null,null,{"$f":"IF(D2=\"\",\"\",\"(\"&D2&\"/\"&$E$2&\")\")","v":""},null,"0度",{"$f":"IF(AND(Q8>=0,R8=0),0,\"\")","v":{"$error":"#VALUE!"}},{"$f":"IF(AND(Q8>=0,R8=0),\"0°0′0″\",\"\")","v":{"$error":"#VALUE!"}}]
[{"$f":"面積計算!A2","v":"件名："},{"$f":"面積計算!B2","v":"福岡市○○区△△町１丁目地内道路測量"},null,null,null,null,null,null,null,null,null,null,null,null,null,null,null,"90度",{"$f":"IF(AND(Q8=0,R8>0),90,\"\")","v":{"$error":"#VALUE!"}},{"$f":"IF(AND(Q8=0,R8>0),\"90°0′0″\",\"\")","v":{"$error":"#VALUE!"}}]
[null,null,null,null,null,null,null,null,null,null,null,null,null,null,null,null,null,"180度",{"$f":"IF(AND(Q8<0,R8=0),180,\"\")","v":{"$error":"#VALUE!"}},{"$f":"IF(AND(Q8<0,R8=0),\"180°0′0″\",\"\")","v":{"$error":"#VALUE!"}}]
["観測日",null,null,null,"天候",null,"軟風",null,"気圧",null,"温度",null,"気象補正",null,"観測者",null,null,"270度",{"$f":"IF(AND(Q8=0,R8<0),270,\"\")","v":{"$error":"#VALUE!"}},{"$f":"IF(AND(Q8=0,R8<0),\"270°0′0″\",\"\")","v":{"$error":"#VALUE!"}},"度",null,"分",null,"秒"]
[null,null,null,null,null,null,null,null,null,null,null,null,null,null,null,null,null,null,{"$f":"IF(AND(Q8>0,R8>0),Q9,\"\")","v":{"$error":"#VALUE!"}},{"$f":"IF(S6=\"\",\"\",U6&\"°\"&W6&\"′\"&Y6&\"″\")","v":{"$error":"#VALUE!"}},{"$f":"IF(S6=\"\",\"\",TRUNC(S6))","v":{"$error":"#VALUE!"}},{"$f":"IF(S6=\"\",\"\",(S6-U6)*60)","v":{"$error":"#VALUE!"}},{"$f":"IF(V6=\"\",\"\",TRUNC(V6))","v":{"$error":"#VALUE!"}},{"$f":"IF(V6=\"\",\"\",(V6-W6)*60)","v":{"$error":"#VALUE!"}},{"$f":"IF(X6=\"\",\"\",ROUND(X6,0))","v":{"$error":"#VALUE!"}}]
["測　　点",null,null,"標識の\n種　類","標　高","X座標",null,"Y座標",null,"方向角","その他",null,"座 標 系","Ⅱ","緯　度","33度","DX","DY",{"$f":"IF(AND(Q8<0,R8>0),(90-Q9),\"\")","v":{"$error":"#VALUE!"}},{"$f":"IF(S7=\"\",\"\",U7&\"°\"&W7&\"′\"&Y7&\"″\")","v":{"$error":"#VALUE!"}},{"$f":"IF(S7=\"\",\"\",TRUNC(S7))","v":{"$error":"#VALUE!"}},{"$f":"IF(S7=\"\",\"\",(S7-U7)*60)","v":{"$error":"#VALUE!"}},{"$f":"IF(V7=\"\",\"\",TRUNC(V7))","v":{"$error":"#VALUE!"}},{"$f":"IF(V7=\"\",\"\",(V7-W7)*60)","v":{"$error":"#VALUE!"}},{"$f":"IF(X7=\"\",\"\",ROUND(X7,0))","v":{"$error":"#VALUE!"}}]
["器械点",null,null,"M",null,{"$f":"IF(B8=\"\",\"\",VLOOKUP(B8,座標入力!$B$3:$D$402,2,FALSE))","v":""},null,{"$f":"IF(B8=\"\",\"\",VLOOKUP(B8,座標入力!$B$3:$D$402,3,FALSE))","v":""},null,"-",null,null,"縮尺係数",0.99990100000000004,"地　域","九州東",{"$f":"F9-F8","v":{"$error":"#VALUE!"}},{"$f":"H9-H8","v":{"$error":"#VALUE!"}},{"$f":"IF(AND(Q8<0,R8<0),(180+Q9),\"\")","v":{"$error":"#VALUE!"}},{"$f":"IF(S8=\"\",\"\",U8&\"°\"&W8&\"′\"&Y8&\"″\")","v":{"$error":"#VALUE!"}},{"$f":"IF(S8=\"\",\"\",TRUNC(S8))","v":{"$error":"#VALUE!"}},{"$f":"IF(S8=\"\",\"\",(S8-U8)*60)","v":{"$error":"#VALUE!"}},{"$f":"IF(V8=\"\",\"\",TRUNC(V8))","v":{"$error":"#VALUE!"}},{"$f":"IF(V8=\"\",\"\",(V8-W8)*60)","v":{"$error":"#VALUE!"}},{"$f":"IF(X8=\"\",\"\",ROUND(X8,0))","v":{"$error":"#VALUE!"}}]
["後視点",null,null,"S",null,{"$f":"IF(B9=\"\",\"\",VLOOKUP(B9,座標入力!$B$3:$D$402,2,FALSE))","v":""},null,{"$f":"IF(B9=\"\",\"\",VLOOKUP(B9,座標入力!$B$3:$D$402,3,FALSE))","v":""},null,{"$f":"IF(H9=\"\",\"\",INDEX($T$1:$T$9,MAX(IF($T$1:$T$9<>\"\",ROW($T$1:$T$9))),1))","v":""},null,null,"平均標高",50,"区　域","福岡県",{"$f":"ATAN(Q8/R8)*180/PI()","v":{"$error":"#VALUE!"}},null,{"$f":"IF(AND(Q8>0,R8<0),(270-Q9),\"\")","v":{"$error":"#VALUE!"}},{"$f":"IF(S9=\"\",\"\",U9&\"°\"&W9&\"′\"&Y9&\"″\")","v":{"$error":"#VALUE!"}},{"$f":"IF(S9=\"\",\"\",TRUNC(S9))","v":{"$error":"#VALUE!"}},{"$f":"IF(S9=\"\",\"\",(S9-U9)*60)","v":{"$error":"#VALUE!"}},{"$f":"IF(V9=\"\",\"\",TRUNC(V9))","v":{"$error":"#VALUE!"}},{"$f":"IF(V9=\"\",\"\",(V9-W9)*60)","v":{"$error":"#VALUE!"}},{"$f":"IF(X9=\"\",\"\",ROUND(X9,0))","v":{"$error":"#VALUE!"}}]
[null,null,null,null,null,null,null,null,null,{"$f":"IF(H9=\"\",\"\",INDEX($S$1:$S$9,MAX(IF($S$1:$S$9<>\"\",ROW($S$1:$S$9))),1))","v":""}]
["視準点","角　　度",null,null,null,null,null,null,null,"距　　離",null,null,null,"平面直角座標\n面上の距離","その他"]
[null,"水平角",null,null,"方向角",null,"高度角",null,null,"斜距離","水平距離","投影補正","縮尺補正",null,"時 間","目標高etc"]
[{"$f":"IF(B9=\"\",\"\",B9)","v":""},null,"0° 0′ 0″",null,{"$f":"IF(J9=\"\",\"\",J9)","v":""},null,null,null,null,null,null,"補正あり","補正あり",{"$f":"IF(OR(F8=\"\",H8=\"\",F9=\"\",H9=\"\"),\"\",SQRT((F8-F9)^2+(H8-H9)^2))","v":""},null,null,"度",null,"分",null,"秒","10進法度","方向角(1)","決定方向角","度",null,"分",null,"秒"]
[null,null,{"$f":"IF(B14=\"\",\"\",Q14&\"°\"&S14&\"′\"&U14&\"″\")","v":""},null,{"$f":"IF(OR(E13=\"\",C14=\"\"),\"\",Y14&\"°\"&AA14&\"′\"&AC14&\"″\")","v":""},null,null,{"$f":"IF(G14=\"\",\"\",ABS(Q28)&\"°\"&ABS(S28)&\"′\"&ABS(U28)&\"″\")","v":""},null,null,{"$f":"IF(H14=\"\",IF(J14=\"\",\"\",J14),IF($G$12=\"高度角\",ROUND(ABS(J14*COS(V28)),3),ROUND(ABS(J14*SIN(V28)),3)))","v":""},{"$f":"IF(OR($N$9=\"\",K14=\"\",$L$13=\"補正なし\"),\"\",ROUND(-$N$9*K14/6370000,3))","v":""},{"$f":"IF(OR($N$8=\"\",K14=\"\",$M$13=\"補正なし\"),\"\",IF(L14=\"\",ROUND(K14*($N$8-1),3),ROUND(AD14*($N$8-1),3)))","v":""},{"$f":"IF(K14=\"\",\"\",SUM(K14:M14))","v":""},null,null,{"$f":"IF(B14=\"\",\"\",TRUNC(B14))","v":""},{"$f":"IF(Q14=\"\",\"\",(B14-Q14)*100)","v":""},{"$f":"IF(R14=\"\",\"\",TRUNC(R14))","v":""},{"$f":"IF(R14=\"\",\"\",(R14-S14)*100)","v":""},{"$f":"IF(T14=\"\",\"\",ROUND(T14,0))","v":""},{"$f":"IF(B14=\"\",\"\",Q14+S14/60+U14/3600)","v":""},{"$f":"$J$10+V14","v":{"$error":"#VALUE!"}},{"$f":"IF(W14>=360,W14-360,W14)","v":{"$error":"#VALUE!"}},{"$f":"IF(OR(E13=\"\",C14=\"\"),\"\",TRUNC(X14))","v":""},{"$f":"IF(X14=\"\",\"\",(X14-Y14)*60)","v":{"$error":"#VALUE!"}},{"$f":"IF(Z14=\"\",\"\",TRUNC(Z14))","v":{"$error":"#VALUE!"}},{"$f":"IF(Z14=\"\",\"\",(Z14-AA14)*60)","v":{"$error":"#VALUE!"}},{"$f":"IF(AB14=\"\",\"\",ROUND(AB14,0))","v":{"$error":"#VALUE!"}},{"$f":"IF(OR(K14=\"\",L14=\"\",$L$13=\"補正なし\"),\"\",K14+L14)","v":""}]
[null,null,{"$f":"IF(B15=\"\",\"\",Q15&\"°\"&S15&\"′\"&U15&\"″\")","v":""},null,{"$f":"IF(OR(E14=\"\",C15=\"\"),\"\",Y15&\"°\"&AA15&\"′\"&AC15&\"″\")","v":""},null,null,{"$f":"IF(G15=\"\",\"\",ABS(Q29)&\"°\"&ABS(S29)&\"′\"&ABS(U29)&\"″\")","v":""},null,null,{"$f":"IF(H15=\"\",IF(J15=\"\",\"\",J15),IF($G$12=\"高度角\",ROUND(ABS(J15*COS(V29)),3),ROUND(ABS(J15*SIN(V29)),3)))","v":""},{"$f":"IF(OR($N$9=\"\",K15=\"\",$L$13=\"補正なし\"),\"\",ROUND(-$N$9*K15/6370000,3))","v":""},{"$f":"IF(OR($N$8=\"\",K15=\"\",$M$13=\"補正なし\"),\"\",IF(L15=\"\",ROUND(K15*($N$8-1),3),ROUND(AD15*($N$8-1),3)))","v":""},"",null,null,{"$f":"IF(B15=\"\",\"\",TRUNC(B15))","v":""},{"$f":"IF(Q15=\"\",\"\",(B15-Q15)*100)","v":""},{"$f":"IF(R15=\"\",\"\",TRUNC(R15))","v":""},{"$f":"IF(R15=\"\",\"\",(R15-S15)*100)","v":""},{"$f":"IF(T15=\"\",\"\",ROUND(T15,0))","v":""},{"$f":"IF(B15=\"\",\"\",Q15+S15/60+U15/3600)","v":""},{"$f":"$J$10+V15","v":{"$error":"#VALUE!"}},{"$f":"IF(W15>=360,W15-360,W15)","v":{"$error":"#VALUE!"}},{"$f":"IF(OR(E14=\"\",C15=\"\"),\"\",TRUNC(X15))","v":""},{"$f":"IF(X15=\"\",\"\",(X15-Y15)*60)","v":{"$error":"#VALUE!"}},{"$f":"IF(Z15=\"\",\"\",TRUNC(Z15))","v":{"$error":"#VALUE!"}},{"$f":"IF(Z15=\"\",\"\",(Z15-AA15)*60)","v":{"$error":"#VALUE!"}},{"$f":"IF(AB15=\"\",\"\",ROUND(AB15,0))","v":{"$error":"#VALUE!"}},{"$f":"IF(OR(K15=\"\",L15=\"\",$L$13=\"補正なし\"),\"\",K15+L15)","v":""}]
[null,null,"",null,{"$f":"IF(OR(E15=\"\",C16=\"\"),\"\",Y16&\"°\"&AA16&\"′\"&AC16&\"″\")","v":""},null,null,"",null,null,"","","","",null,null,"","","","","","",{"$error":"#VALUE!"},{"$error":"#VALUE!"},"",{"$error":"#VALUE!"},{"$error":"#VALUE!"},{"$error":"#VALUE!"},{"$error":"#VALUE!"},""]
[null,null,"",null,"",null,null,"",null,null,"","","","",null,null,"","","","","","",{"$error":"#VALUE!"},{"$error":"#VALUE!"},"",{"$error":"#VALUE!"},{"$error":"#VALUE!"},{"$error":"#VALUE!"},{"$error":"#VALUE!"},{"$f":"IF(OR(K17=\"\",L17=\"\",$L$13=\"補正なし\"),\"\",K17+L17)","v":""}]
[null,null,"",null,"",null,null,"",null,null,"",{"$f":"IF(OR($N$9=\"\",K18=\"\",$L$13=\"補正なし\"),\"\",ROUND(-$N$9*K18/6370000,3))","v":""},{"$f":"IF(OR($N$8=\"\",K18=\"\",$M$13=\"補正なし\"),\"\",IF(L18=\"\",ROUND(K18*($N$8-1),3),ROUND(AD18*($N$8-1),3)))","v":""},"",null,null,"","","","","","",{"$error":"#VALUE!"},{"$error":"#VALUE!"},"",{"$error":"#VALUE!"},{"$error":"#VALUE!"},{"$error":"#VALUE!"},{"$error":"#VALUE!"},""]
[null,null,"",null,"",null,null,"",null,null,"","","",{"$f":"IF(K19=\"\",\"\",SUM(K19:M19))","v":""},null,null,"","","","","","",{"$error":"#VALUE!"},{"$error":"#VALUE!"},"",{"$error":"#VALUE!"},{"$error":"#VALUE!"},{"$error":"#VALUE!"},{"$error":"#VALUE!"},""]
[null,null,"",null,"",null,null,"",null,null,"","","","",null,null,"","","","","","",{"$error":"#VALUE!"},{"$error":"#VALUE!"},"",{"$error":"#VALUE!"},{"$error":"#VALUE!"},{"$error":"#VALUE!"},{"$error":"#VALUE!"},""]
[null,null,"",null,"",null,null,"",null,null,"","","","",null,null,"","","","","","",{"$error":"#VALUE!"},{"$error":"#VALUE!"},"",{"$error":"#VALUE!"},{"$error":"#VALUE!"},{"$error":"#VALUE!"},{"$error":"#VALUE!"},""]
[null,null,"",null,"",null,null,"",null,null,"","","","",null,null,"","","","","","",{"$error":"#VALUE!"},{"$error":"#VALUE!"},"",{"$error":"#VALUE!"},{"$error":"#VALUE!"},{"$error":"#VALUE!"},{"$error":"#VALUE!"},""]
[null,null,"",null,"",null,null,"",null,null,"","","","",null,null,"","","","","","",{"$error":"#VALUE!"},{"$error":"#VALUE!"},"",{"$error":"#VALUE!"},{"$error":"#VALUE!"},{"$error":"#VALUE!"},{"$error":"#VALUE!"},{"$f":"IF(OR(K23=\"\",L23=\"\",$L$13=\"補正なし\"),\"\",K23+L23)","v":""}]
[null,null,null,null,null,null,null,null,null,null,null,"※投影補正にジオイド高は考慮してません。"]
["《 座標計算書 》"]
[]
["視準点","X座標",null,null,"Y座標",null,"標　高",null,"その他",null,null,"記　号","標識の種類",null,null,null,"度",null,"分",null,"秒","10進法度"]
[{"$f":"IF(A14=\"\",\"\",A14)","v":""},{"$f":"IF(OR(C14=\"\",N14=\"\",$F$8=\"\"),\"\",$F$8+N14*COS(X14))","v":""},null,null,{"$f":"IF(OR($H$8=\"\",C14=\"\",N14=\"\"),\"\",$H$8+N14*SIN(V14))","v":""},null,null,null,null,null,null,"M","ミカゲ石",null,null,null,{"$f":"IF(G14=\"\",\"\",TRUNC(G14))","v":""},{"$f":"IF(G14=\"\",\"\",(G14-Q28)*100)","v":""},{"$f":"IF(R28=\"\",\"\",TRUNC(R28))","v":""},{"$f":"IF(R28=\"\",\"\",(R28-S28)*100)","v":""},{"$f":"IF(T28=\"\",\"\",ROUND(T28,0))","v":""},{"$f":"IF(G14=\"\",\"\",Q28+S28/60+U28/3600)","v":""}]
[{"$f":"IF(A15=\"\",\"\",A15)","v":""},{"$f":"IF(OR(C15=\"\",N15=\"\",$F$8=\"\"),\"\",$F$8+N15*COS(X15))","v":""},null,null,{"$f":"IF(OR($H$8=\"\",C15=\"\",N15=\"\"),\"\",$H$8+N15*SIN(V15))","v":""},null,null,null,null,null,null,"C","コンクリート杭",null,null,null,{"$f":"IF(G15=\"\",\"\",TRUNC(G15))","v":""},{"$f":"IF(G15=\"\",\"\",(G15-Q29)*100)","v":""},{"$f":"IF(R29=\"\",\"\",TRUNC(R29))","v":""},{"$f":"IF(R29=\"\",\"\",(R29-S29)*100)","v":""},{"$f":"IF(T29=\"\",\"\",ROUND(T29,0))","v":""},{"$f":"IF(G15=\"\",\"\",Q29+S29/60+U29/3600)","v":""}]
["","",null,null,"",null,null,null,null,null,null,"S","真鍮製金属標",null,null,null,{"$f":"IF(G16=\"\",\"\",TRUNC(G16))","v":""},{"$f":"IF(G16=\"\",\"\",(G16-Q30)*100)","v":""},"",{"$f":"IF(R30=\"\",\"\",(R30-S30)*100)","v":""},"",{"$f":"IF(G16=\"\",\"\",Q30+S30/60+U30/3600)","v":""}]
["","",null,null,"",null,null,null,null,null,null,"B","金属鋲",null,null,null,"","","","","",""]
["","",null,null,"",null,null,null,null,null,null,"P","プレート板",null,null,null,"","","","","",""]
["","",null,null,"",null,null,null,null,null,null,"T","木杭",null,null,null,{"$f":"IF(G19=\"\",\"\",TRUNC(G19))","v":""},{"$f":"IF(G19=\"\",\"\",(G19-Q33)*100)","v":""},"","","",""]
["","",null,null,"",null,null,null,null,null,null,"K","刻み",null,null,null,"","","","","",""]
["","",null,null,"",null,null,null,null,null,null,null,null,null,null,null,"","","","","",""]
["","",null,null,"",null,null,null,null,null,null,null,null,null,null,null,"","","","","",""]
["","",null,null,"",null,null,null,null,null,null,null,{"$f":"座標入力!$J$3","v":"C04O05K05U00DS1"},null,{"$f":"座標入力!J4","v":"座標入力使用者に名前入力"},null,"","","","","",""]
[]
["《 観測手簿 》",null,null,{"$f":"IF(OR(B45=\"\",B46=\"\"),\"\",IF(COUNTA(B45:C46)>0,1,0))","v":1},{"$f":"IF(D39=\"\",\"\",D2+D39)","v":{"$error":"#VALUE!"}},null,null,null,null,null,null,null,null,null,null,{"$f":"IF(D39=\"\",\"\",\"(\"&E39&\"/\"&$E$2&\")\")","v":{"$error":"#VALUE!"}},null,"0度",{"$f":"IF(AND(Q45>=0,R45=0),0,\"\")","v":{"$error":"#N/A"}},{"$f":"IF(AND(Q45>=0,R45=0),\"0°0′0″\",\"\")","v":{"$error":"#N/A"}}]
[{"$f":"$A$3","v":"件名："},{"$f":"$B$3","v":"福岡市○○区△△町１丁目地内道路測量"},null,null,null,null,null,null,null,null,null,null,null,null,null,null,null,"90度",{"$f":"IF(AND(Q45=0,R45>0),90,\"\")","v":{"$error":"#N/A"}},{"$f":"IF(AND(Q45=0,R45>0),\"90°0′0″\",\"\")","v":{"$error":"#N/A"}}]
[null,null,null,null,null,null,null,null,null,null,null,null,null,null,null,null,null,"180度",{"$f":"IF(AND(Q45<0,R45=0),180,\"\")","v":{"$error":"#N/A"}},{"$f":"IF(AND(Q45<0,R45=0),\"180°0′0″\",\"\")","v":{"$error":"#N/A"}}]
["観測日",{"$f":"$B$5","v":"00:00:00"},null,null,"天候",{"$f":"$F$5","v":0},{"$f":"$G$5","v":"軟風"},{"$f":"$H$5","v":0},"気圧",{"$f":"$J$5","v":0},"温度",{"$f":"$L$5","v":0},"気象補正",{"$f":"$N$5","v":0},"観測者",{"$f":"$P$5","v":0},null,"270度",{"$f":"IF(AND(Q45=0,R45<0),270,\"\")","v":{"$error":"#N/A"}},{"$f":"IF(AND(Q45=0,R45<0),\"270°0′0″\",\"\")","v":{"$error":"#N/A"}},"度",null,"分",null,"秒"]
[null,null,null,null,null,null,null,null,null,null,null,null,null,null,null,null,null,null,{"$f":"IF(AND(Q45>0,R45>0),Q46,\"\")","v":{"$error":"#N/A"}},{"$f":"IF(S43=\"\",\"\",U43&\"°\"&W43&\"′\"&Y43&\"″\")","v":{"$error":"#N/A"}},{"$f":"IF(S43=\"\",\"\",TRUNC(S43))","v":{"$error":"#N/A"}},{"$f":"IF(S43=\"\",\"\",(S43-U43)*60)","v":{"$error":"#N/A"}},{"$f":"IF(V43=\"\",\"\",TRUNC(V43))","v":{"$error":"#N/A"}},{"$f":"IF(V43=\"\",\"\",(V43-W43)*60)","v":{"$error":"#N/A"}},{"$f":"IF(X43=\"\",\"\",ROUND(X43,0))","v":{"$error":"#N/A"}}]
["測　　点",null,null,"標識の\n種　類","標　高","X座標",null,"Y座標",null,"方向角","その他",null,"座 標 系",{"$f":"$N$7","v":"Ⅱ"},"緯　度",{"$f":"$P$7","v":"33度"},"DX","DY",{"$f":"IF(AND(Q45<0,R45>0),(90-Q46),\"\")","v":{"$error":"#N/A"}},{"$f":"IF(S44=\"\",\"\",U44&\"°\"&W44&\"′\"&Y44&\"″\")","v":{"$error":"#N/A"}},{"$f":"IF(S44=\"\",\"\",TRUNC(S44))","v":{"$error":"#N/A"}},{"$f":"IF(S44=\"\",\"\",(S44-U44)*60)","v":{"$error":"#N/A"}},{"$f":"IF(V44=\"\",\"\",TRUNC(V44))","v":{"$error":"#N/A"}},{"$f":"IF(V44=\"\",\"\",(V44-W44)*60)","v":{"$error":"#N/A"}},{"$f":"IF(X44=\"\",\"\",ROUND(X44,0))","v":{"$error":"#N/A"}}]
["器械点","AR44",null,"M",null,{"$f":"IF(B45=\"\",\"\",VLOOKUP(B45,座標入力!$B$3:$D$402,2,FALSE))","v":{"$error":"#N/A"}},null,{"$f":"IF(B45=\"\",\"\",VLOOKUP(B45,座標入力!$B$3:$D$402,3,FALSE))","v":{"$error":"#N/A"}},null,"-",null,null,"縮尺係数",0.99990100000000004,"地　域",{"$f":"$P$8","v":"九州東"},{"$f":"F46-F45","v":{"$error":"#N/A"}},{"$f":"H46-H45","v":{"$error":"#N/A"}},{"$f":"IF(AND(Q45<0,R45<0),(180+Q46),\"\")","v":{"$error":"#N/A"}},{"$f":"IF(S45=\"\",\"\",U45&\"°\"&W45&\"′\"&Y45&\"″\")","v":{"$error":"#N/A"}},{"$f":"IF(S45=\"\",\"\",TRUNC(S45))","v":{"$error":"#N/A"}},{"$f":"IF(S45=\"\",\"\",(S45-U45)*60)","v":{"$error":"#N/A"}},{"$f":"IF(V45=\"\",\"\",TRUNC(V45))","v":{"$error":"#N/A"}},{"$f":"IF(V45=\"\",\"\",(V45-W45)*60)","v":{"$error":"#N/A"}},{"$f":"IF(X45=\"\",\"\",ROUND(X45,0))","v":{"$error":"#N/A"}}]
["後視点","Z44",null,"S",null,{"$f":"IF(B46=\"\",\"\",VLOOKUP(B46,座標入力!$B$3:$D$402,2,FALSE))","v":{"$error":"#N/A"}},null,{"$f":"IF(B46=\"\",\"\",VLOOKUP(B46,座標入力!$B$3:$D$402,3,FALSE))","v":{"$error":"#N/A"}},null,{"$f":"IF(H46=\"\",\"\",INDEX(T1:T46,MAX(IF(T1:T46<>\"\",ROW(T1:T46))),1))","v":{"$error":"#N/A"}},null,null,"平均標高",50,"区　域",{"$f":"$P$9","v":"福岡県"},{"$f":"ATAN(Q45/R45)*180/PI()","v":{"$error":"#N/A"}},null,{"$f":"IF(AND(Q45>0,R45<0),(270-Q46),\"\")","v":{"$error":"#N/A"}},{"$f":"IF(S46=\"\",\"\",U46&\"°\"&W46&\"′\"&Y46&\"″\")","v":{"$error":"#N/A"}},{"$f":"IF(S46=\"\",\"\",TRUNC(S46))","v":{"$error":"#N/A"}},{"$f":"IF(S46=\"\",\"\",(S46-U46)*60)","v":{"$error":"#N/A"}},{"$f":"IF(V46=\"\",\"\",TRUNC(V46))","v":{"$error":"#N/A"}},{"$f":"IF(V46=\"\",\"\",(V46-W46)*60)","v":{"$error":"#N/A"}},{"$f":"IF(X46=\"\",\"\",ROUND(X46,0))","v":{"$error":"#N/A"}}]
[null,null,null,null,null,null,null,null,null,{"$f":"IF(H46=\"\",\"\",INDEX($S$1:$S$46,MAX(IF($S$1:$S$46<>\"\",ROW($S$1:$S$46))),1))","v":{"$error":"#N/A"}}]
["視準点","角　　度",null,null,null,null,null,null,null,"距　　離",null,null,null,"平面直角座標\n面上の距離","その他"]
[null,"水平角",null,null,"方向角",null,"高度角",null,null,"斜距離","球面距離","投影補正","縮尺補正",null,"時 間","目標高etc"]
[{"$f":"IF(B46=\"\",\"\",B46)","v":"Z44"},null,"0° 0′ 0″",null,{"$f":"IF(J46=\"\",\"\",J46)","v":{"$error":"#N/A"}},null,null,null,null,null,null,"補正あり","補正なし",{"$f":"IF(OR(F45=\"\",H45=\"\",F46=\"\",H46=\"\"),\"\",SQRT((F45-F46)^2+(H45-H46)^2))","v":{"$error":"#N/A"}},"07:15:00",null,"度",null,"分",null,"秒","10進法度","方向角(1)","決定方向角","度",null,"分",null,"秒"]
["P1",128.5959,{"$f":"IF(B51=\"\",\"\",Q51&\"°\"&S51&\"′\"&U51&\"″\")","v":"128°59′59″"},null,{"$f":"IF(OR(E50=\"\",C51=\"\"),\"\",Y51&\"°\"&AA51&\"′\"&AC51&\"″\")","v":{"$error":"#N/A"}},null,-9.3628999999999998,{"$f":"IF(G51=\"\",\"\",ABS(Q65)&\"°\"&ABS(S65)&\"′\"&ABS(U65)&\"″\")","v":"9°36′29″"},null,100,{"$f":"IF(H51=\"\",IF(J51=\"\",\"\",J51),IF($G$49=\"高度角\",ROUND(ABS(J51*COS(V65)),3),ROUND(ABS(J51*SIN(V65)),3)))","v":98.325000000000003},{"$f":"IF(OR($N$9=\"\",K51=\"\",$L$50=\"補正なし\"),\"\",ROUND(-$N$9*K51/6370000,3))","v":-1E-3},{"$f":"IF(OR($N$8=\"\",K51=\"\",$M$50=\"補正なし\"),\"\",IF(L51=\"\",ROUND(K51*($N$8-1),3),ROUND(AD51*($N$8-1),3)))","v":""},{"$f":"IF(K51=\"\",\"\",SUM(K51:M51))","v":98.323999999999998},null,null,{"$f":"IF(B51=\"\",\"\",TRUNC(B51))","v":128},{"$f":"IF(Q51=\"\",\"\",(B51-Q51)*100)","v":59.590000000000032},{"$f":"IF(R51=\"\",\"\",TRUNC(R51))","v":59},{"$f":"IF(R51=\"\",\"\",(R51-S51)*100)","v":59.000000000003183},{"$f":"IF(T51=\"\",\"\",ROUND(T51,0))","v":59},{"$f":"IF(B51=\"\",\"\",Q51+S51/60+U51/3600)","v":128.9997222222222},{"$f":"$J$47+V51","v":{"$error":"#N/A"}},{"$f":"IF(W51>=360,W51-360,W51)","v":{"$error":"#N/A"}},{"$f":"IF(OR(E50=\"\",C51=\"\"),\"\",TRUNC(X51))","v":{"$error":"#N/A"}},{"$f":"IF(X51=\"\",\"\",(X51-Y51)*60)","v":{"$error":"#N/A"}},{"$f":"IF(Z51=\"\",\"\",TRUNC(Z51))","v":{"$error":"#N/A"}},{"$f":"IF(Z51=\"\",\"\",(Z51-AA51)*60)","v":{"$error":"#N/A"}},{"$f":"IF(AB51=\"\",\"\",ROUND(AB51,0))","v":{"$error":"#N/A"}},{"$f":"IF(OR(K51=\"\",L51=\"\",$L$50=\"補正なし\"),\"\",K51+L51)","v":98.323999999999998}]
["P2",1.2636000000000001,{"$f":"IF(B52=\"\",\"\",Q52&\"°\"&S52&\"′\"&U52&\"″\")","v":"1°26′36″"},null,{"$f":"IF(OR(E51=\"\",C52=\"\"),\"\",Y52&\"°\"&AA52&\"′\"&AC52&\"″\")","v":{"$error":"#N/A"}},null,12.3636,{"$f":"IF(G52=\"\",\"\",ABS(Q66)&\"°\"&ABS(S66)&\"′\"&ABS(U66)&\"″\")","v":"12°36′36″"},null,10,{"$f":"IF(H52=\"\",IF(J52=\"\",\"\",J52),IF($G$49=\"高度角\",ROUND(ABS(J52*COS(V66)),3),ROUND(ABS(J52*SIN(V66)),3)))","v":9.99},{"$f":"IF(OR($N$9=\"\",K52=\"\",$L$50=\"補正なし\"),\"\",ROUND(-$N$9*K52/6370000,3))","v":0},{"$f":"IF(OR($N$8=\"\",K52=\"\",$M$50=\"補正なし\"),\"\",IF(L52=\"\",ROUND(K52*($N$8-1),3),ROUND(AD52*($N$8-1),3)))","v":""},9.99,null,null,{"$f":"IF(B52=\"\",\"\",TRUNC(B52))","v":1},{"$f":"IF(Q52=\"\",\"\",(B52-Q52)*100)","v":26.360000000000007},{"$f":"IF(R52=\"\",\"\",TRUNC(R52))","v":26},{"$f":"IF(R52=\"\",\"\",(R52-S52)*100)","v":36.000000000000654},{"$f":"IF(T52=\"\",\"\",ROUND(T52,0))","v":36},{"$f":"IF(B52=\"\",\"\",Q52+S52/60+U52/3600)","v":1.4433333333333334},{"$f":"$J$47+V52","v":{"$error":"#N/A"}},{"$f":"IF(W52>=360,W52-360,W52)","v":{"$error":"#N/A"}},{"$f":"IF(OR(E51=\"\",C52=\"\"),\"\",TRUNC(X52))","v":{"$error":"#N/A"}},{"$f":"IF(X52=\"\",\"\",(X52-Y52)*60)","v":{"$error":"#N/A"}},{"$f":"IF(Z52=\"\",\"\",TRUNC(Z52))","v":{"$error":"#N/A"}},{"$f":"IF(Z52=\"\",\"\",(Z52-AA52)*60)","v":{"$error":"#N/A"}},{"$f":"IF(AB52=\"\",\"\",ROUND(AB52,0))","v":{"$error":"#N/A"}},{"$f":"IF(OR(K52=\"\",L52=\"\",$L$50=\"補正なし\"),\"\",K52+L52)","v":9.99}]
["P3",25.282800000000002,"25°28′28″",null,{"$f":"IF(OR(E52=\"\",C53=\"\"),\"\",Y53&\"°\"&AA53&\"′\"&AC53&\"″\")","v":{"$error":"#N/A"}},null,-12.3636,"12°36′36″",null,100,99.905000000000001,{"$f":"IF(OR($N$9=\"\",K53=\"\",$L$50=\"補正なし\"),\"\",ROUND(-$N$9*K53/6370000,3))","v":-1E-3},{"$f":"IF(OR($N$8=\"\",K53=\"\",$M$50=\"補正なし\"),\"\",IF(L53=\"\",ROUND(K53*($N$8-1),3),ROUND(AD53*($N$8-1),3)))","v":""},99.903999999999996,null,null,25,28.280000000000172,28,28.000000000017167,28,25.474444444444444,{"$error":"#N/A"},{"$f":"IF(W53>=360,W53-360,W53)","v":{"$error":"#N/A"}},{"$error":"#N/A"},{"$error":"#N/A"},{"$error":"#N/A"},{"$error":"#N/A"},{"$error":"#N/A"},{"$f":"IF(OR(K53=\"\",L53=\"\",$L$50=\"補正なし\"),\"\",K53+L53)","v":99.903999999999996}]
["P4",3.2536,"3°25′36″",null,{"$error":"#N/A"},null,9.3628999999999998,"9°36′29″",null,100,98.325000000000003,{"$f":"IF(OR($N$9=\"\",K54=\"\",$L$50=\"補正なし\"),\"\",ROUND(-$N$9*K54/6370000,3))","v":-1E-3},"",98.323999999999998,null,null,3,25.360000000000007,25,36.000000000000654,36,3.4266666666666663,{"$error":"#N/A"},{"$error":"#N/A"},{"$error":"#N/A"},{"$error":"#N/A"},{"$error":"#N/A"},{"$error":"#N/A"},{"$error":"#N/A"},{"$f":"IF(OR(K54=\"\",L54=\"\",$L$50=\"補正なし\"),\"\",K54+L54)","v":98.323999999999998}]
["P5",4.2336,"4°23′36″",null,{"$error":"#N/A"},null,null,"",null,100,100,-1E-3,"",99.998999999999995,null,null,4,23.360000000000003,23,36.000000000000298,36,4.3933333333333335,{"$error":"#N/A"},{"$error":"#N/A"},{"$error":"#N/A"},{"$error":"#N/A"},{"$error":"#N/A"},{"$error":"#N/A"},{"$error":"#N/A"},{"$f":"IF(OR(K55=\"\",L55=\"\",$L$50=\"補正なし\"),\"\",K55+L55)","v":99.998999999999995}]
["P6",3.3029999999999999,"3°30′30″",null,{"$error":"#N/A"},null,null,"",null,100,100,-1E-3,{"$f":"IF(OR($N$8=\"\",K56=\"\",$M$50=\"補正なし\"),\"\",IF(L56=\"\",ROUND(K56*($N$8-1),3),ROUND(AD56*($N$8-1),3)))","v":""},99.998999999999995,null,null,3,30.299999999999994,30,29.999999999999361,30,3.5083333333333333,{"$error":"#N/A"},{"$error":"#N/A"},{"$error":"#N/A"},{"$error":"#N/A"},{"$error":"#N/A"},{"$error":"#N/A"},{"$error":"#N/A"},99.998999999999995]
["P7",5.3029999999999999,"5°30′30″",null,{"$error":"#N/A"},null,null,"",null,300,300,-2E-3,{"$f":"IF(OR($N$8=\"\",K57=\"\",$M$50=\"補正なし\"),\"\",IF(L57=\"\",ROUND(K57*($N$8-1),3),ROUND(AD57*($N$8-1),3)))","v":""},299.99799999999999,null,null,5,30.299999999999994,30,29.999999999999361,30,5.5083333333333337,{"$error":"#N/A"},{"$error":"#N/A"},{"$error":"#N/A"},{"$error":"#N/A"},{"$error":"#N/A"},{"$error":"#N/A"},{"$error":"#N/A"},299.99799999999999]
["P8",5,"5°0′0″",null,{"$error":"#N/A"},null,null,"",null,100,100,{"$f":"IF(OR($N$9=\"\",K58=\"\",$L$50=\"補正なし\"),\"\",ROUND(-$N$9*K58/6370000,3))","v":-1E-3},"",99.998999999999995,null,null,5,0,0,0,0,5,{"$error":"#N/A"},{"$error":"#N/A"},{"$error":"#N/A"},{"$error":"#N/A"},{"$error":"#N/A"},{"$error":"#N/A"},{"$error":"#N/A"},99.998999999999995]
["P9",359,"359°0′0″",null,{"$error":"#N/A"},null,null,"",null,100,100,-1E-3,"",99.998999999999995,null,null,359,0,0,0,0,359,{"$error":"#N/A"},{"$error":"#N/A"},{"$error":"#N/A"},{"$error":"#N/A"},{"$error":"#N/A"},{"$error":"#N/A"},{"$error":"#N/A"},99.998999999999995]
["P10",1.2536,"1°25′36″",null,{"$error":"#N/A"},null,null,"",null,100,100,-1E-3,"",99.998999999999995,"14:25:00",null,1,25.360000000000007,25,36.000000000000654,36,1.4266666666666667,{"$error":"#N/A"},{"$error":"#N/A"},{"$error":"#N/A"},{"$error":"#N/A"},{"$error":"#N/A"},{"$error":"#N/A"},{"$error":"#N/A"},99.998999999999995]
[null,null,null,null,null,null,null,null,null,null,null,"※投影補正にジオイド高は考慮してません。"]
["《 座標計算書 》"]
[]
["視準点","X座標",null,null,"Y座標",null,"標　高",null,"その他",null,null,"記　号","標識の種類",null,null,null,"度",null,"分",null,"秒","10進法度"]
[{"$f":"IF(A51=\"\",\"\",A51)","v":"P1"},{"$f":"IF(OR(C51=\"\",N51=\"\",$F$45=\"\"),\"\",$F$8+N51*COS(X51))","v":{"$error":"#N/A"}},null,null,{"$f":"IF(OR($H$45=\"\",C51=\"\",N51=\"\"),\"\",$H$45+N51*SIN(V51))","v":{"$error":"#N/A"}},null,null,null,null,null,null,"M","ミカゲ石",null,null,null,{"$f":"IF(G51=\"\",\"\",TRUNC(G51))","v":-9},{"$f":"IF(G51=\"\",\"\",(G51-Q65)*100)","v":-36.289999999999978},{"$f":"IF(R65=\"\",\"\",TRUNC(R65))","v":-36},{"$f":"IF(R65=\"\",\"\",(R65-S65)*100)","v":-28.999999999997783},{"$f":"IF(T65=\"\",\"\",ROUND(T65,0))","v":-29},{"$f":"IF(G51=\"\",\"\",Q65+S65/60+U65/3600)","v":-9.6080555555555556}]
[{"$f":"IF(A52=\"\",\"\",A52)","v":"P2"},{"$f":"IF(OR(C52=\"\",N52=\"\",$F$45=\"\"),\"\",$F$8+N52*COS(X52))","v":{"$error":"#N/A"}},null,null,{"$f":"IF(OR($H$45=\"\",C52=\"\",N52=\"\"),\"\",$H$45+N52*SIN(V52))","v":{"$error":"#N/A"}},null,null,null,null,null,null,"C","コンクリート杭",null,null,null,{"$f":"IF(G52=\"\",\"\",TRUNC(G52))","v":12},{"$f":"IF(G52=\"\",\"\",(G52-Q66)*100)","v":36.359999999999992},{"$f":"IF(R66=\"\",\"\",TRUNC(R66))","v":36},{"$f":"IF(R66=\"\",\"\",(R66-S66)*100)","v":35.999999999999233},{"$f":"IF(T66=\"\",\"\",ROUND(T66,0))","v":36},{"$f":"IF(G52=\"\",\"\",Q66+S66/60+U66/3600)","v":12.61}]
["P3",{"$error":"#N/A"},null,null,{"$f":"IF(OR($H$45=\"\",C53=\"\",N53=\"\"),\"\",$H$45+N53*SIN(V53))","v":{"$error":"#N/A"}},null,null,null,null,null,null,"S","真鍮製金属標",null,null,null,-12,-36.359999999999992,-36,-35.999999999999233,-36,-12.61]
["P4",{"$error":"#N/A"},null,null,{"$error":"#N/A"},null,null,null,null,null,null,"B","金属鋲",null,null,null,9,36.289999999999978,36,28.999999999997783,29,9.6080555555555556]
["P5",{"$error":"#N/A"},null,null,{"$error":"#N/A"},null,null,null,null,null,null,"P","プレート板",null,null,null,{"$f":"IF(G55=\"\",\"\",TRUNC(G55))","v":""},"","","","",""]
["P6",{"$error":"#N/A"},null,null,{"$error":"#N/A"},null,null,null,null,null,null,"T","木杭",null,null,null,"","","","","",""]
["P7",{"$error":"#N/A"},null,null,{"$error":"#N/A"},null,null,null,null,null,null,"K","刻み",null,null,null,"","","","","",""]
["P8",{"$error":"#N/A"},null,null,{"$error":"#N/A"},null,null,null,null,null,null,null,null,null,null,null,"","","","","",""]
["P9",{"$error":"#N/A"},null,null,{"$error":"#N/A"},null,null,null,null,null,null,null,null,null,null,null,"","","","","",""]
["P10",{"$error":"#N/A"},null,null,{"$error":"#N/A"},null,null,null,null,null,null,null,{"$f":"座標入力!$J$3","v":"C04O05K05U00DS1"},null,{"$f":"O37","v":"座標入力使用者に名前入力"},null,"","","","","",""]
[]
["《 観測手簿 》",null,null,{"$f":"IF(OR(B82=\"\",B83=\"\"),\"\",IF(COUNTA(B82:C83)>0,1,0))","v":1},{"$f":"IF(D76=\"\",\"\",D2+D39+D76)","v":{"$error":"#VALUE!"}},null,null,null,null,null,null,null,null,null,null,{"$f":"IF(D76=\"\",\"\",\"(\"&E76&\"/\"&$E$2&\")\")","v":{"$error":"#VALUE!"}},null,"0度",{"$f":"IF(AND(Q82>=0,R82=0),0,\"\")","v":{"$error":"#N/A"}},{"$f":"IF(AND(Q82>=0,R82=0),\"0°0′0″\",\"\")","v":{"$error":"#N/A"}}]
[{"$f":"$A$3","v":"件名："},{"$f":"$B$3","v":"福岡市○○区△△町１丁目地内道路測量"},null,null,null,null,null,null,null,null,null,null,null,null,null,null,null,"90度",{"$f":"IF(AND(Q82=0,R82>0),90,\"\")","v":{"$error":"#N/A"}},{"$f":"IF(AND(Q82=0,R82>0),\"90°0′0″\",\"\")","v":{"$error":"#N/A"}}]
[null,null,null,null,null,null,null,null,null,null,null,null,null,null,null,null,null,"180度",{"$f":"IF(AND(Q82<0,R82=0),180,\"\")","v":{"$error":"#N/A"}},{"$f":"IF(AND(Q82<0,R82=0),\"180°0′0″\",\"\")","v":{"$error":"#N/A"}}]
["観測日",{"$f":"$B$5","v":"00:00:00"},null,null,"天候",{"$f":"$F$5","v":0},{"$f":"$G$5","v":"軟風"},{"$f":"$H$5","v":0},"気圧",{"$f":"$J$5","v":0},"温度",{"$f":"$L$5","v":0},"気象補正",{"$f":"$N$5","v":0},"観測者",{"$f":"$P$5","v":0},null,"270度",{"$f":"IF(AND(Q82=0,R82<0),270,\"\")","v":{"$error":"#N/A"}},{"$f":"IF(AND(Q82=0,R82<0),\"270°0′0″\",\"\")","v":{"$error":"#N/A"}},"度",null,"分",null,"秒"]
[null,null,null,null,null,null,null,null,null,null,null,null,null,null,null,null,null,null,{"$f":"IF(AND(Q82>0,R82>0),Q83,\"\")","v":{"$error":"#N/A"}},{"$f":"IF(S80=\"\",\"\",U80&\"°\"&W80&\"′\"&Y80&\"″\")","v":{"$error":"#N/A"}},{"$f":"IF(S80=\"\",\"\",TRUNC(S80))","v":{"$error":"#N/A"}},{"$f":"IF(S80=\"\",\"\",(S80-U80)*60)","v":{"$error":"#N/A"}},{"$f":"IF(V80=\"\",\"\",TRUNC(V80))","v":{"$error":"#N/A"}},{"$f":"IF(V80=\"\",\"\",(V80-W80)*60)","v":{"$error":"#N/A"}},{"$f":"IF(X80=\"\",\"\",ROUND(X80,0))","v":{"$error":"#N/A"}}]
["測　　点",null,null,"標識の\n種　類","標　高","X座標",null,"Y座標",null,"方向角","その他",null,"座 標 系",{"$f":"$N$7","v":"Ⅱ"},"緯　度",{"$f":"$P$7","v":"33度"},"DX","DY",{"$f":"IF(AND(Q82<0,R82>0),(90-Q83),\"\")","v":{"$error":"#N/A"}},{"$f":"IF(S81=\"\",\"\",U81&\"°\"&W81&\"′\"&Y81&\"″\")","v":{"$error":"#N/A"}},{"$f":"IF(S81=\"\",\"\",TRUNC(S81))","v":{"$error":"#N/A"}},{"$f":"IF(S81=\"\",\"\",(S81-U81)*60)","v":{"$error":"#N/A"}},{"$f":"IF(V81=\"\",\"\",TRUNC(V81))","v":{"$error":"#N/A"}},{"$f":"IF(V81=\"\",\"\",(V81-W81)*60)","v":{"$error":"#N/A"}},{"$f":"IF(X81=\"\",\"\",ROUND(X81,0))","v":{"$error":"#N/A"}}]
["器械点","AR43",null,"M",null,{"$f":"IF(B82=\"\",\"\",VLOOKUP(B82,座標入力!$B$3:$D$402,2,FALSE))","v":{"$error":"#N/A"}},null,{"$f":"IF(B82=\"\",\"\",VLOOKUP(B82,座標入力!$B$3:$D$402,3,FALSE))","v":{"$error":"#N/A"}},null,"-",null,null,"縮尺係数",0.99990100000000004,"地　域",{"$f":"$P$8","v":"九州東"},{"$f":"F83-F82","v":{"$error":"#N/A"}},{"$f":"H83-H82","v":{"$error":"#N/A"}},{"$f":"IF(AND(Q82<0,R82<0),(180+Q83),\"\")","v":{"$error":"#N/A"}},{"$f":"IF(S82=\"\",\"\",U82&\"°\"&W82&\"′\"&Y82&\"″\")","v":{"$error":"#N/A"}},{"$f":"IF(S82=\"\",\"\",TRUNC(S82))","v":{"$error":"#N/A"}},{"$f":"IF(S82=\"\",\"\",(S82-U82)*60)","v":{"$error":"#N/A"}},{"$f":"IF(V82=\"\",\"\",TRUNC(V82))","v":{"$error":"#N/A"}},{"$f":"IF(V82=\"\",\"\",(V82-W82)*60)","v":{"$error":"#N/A"}},{"$f":"IF(X82=\"\",\"\",ROUND(X82,0))","v":{"$error":"#N/A"}}]
["後視点","Z40",null,"S",null,{"$f":"IF(B83=\"\",\"\",VLOOKUP(B83,座標入力!$B$3:$D$402,2,FALSE))","v":{"$error":"#N/A"}},null,{"$f":"IF(B83=\"\",\"\",VLOOKUP(B83,座標入力!$B$3:$D$402,3,FALSE))","v":{"$error":"#N/A"}},null,{"$f":"IF(H83=\"\",\"\",INDEX($T$1:$T$83,MAX(IF($T$1:$T$83<>\"\",ROW($T$1:$T$83))),1))","v":{"$error":"#N/A"}},null,null,"平均標高",50,"区　域",{"$f":"$P$9","v":"福岡県"},{"$f":"ATAN(Q82/R82)*180/PI()","v":{"$error":"#N/A"}},null,{"$f":"IF(AND(Q82>0,R82<0),(270-Q83),\"\")","v":{"$error":"#N/A"}},{"$f":"IF(S83=\"\",\"\",U83&\"°\"&W83&\"′\"&Y83&\"″\")","v":{"$error":"#N/A"}},{"$f":"IF(S83=\"\",\"\",TRUNC(S83))","v":{"$error":"#N/A"}},{"$f":"IF(S83=\"\",\"\",(S83-U83)*60)","v":{"$error":"#N/A"}},{"$f":"IF(V83=\"\",\"\",TRUNC(V83))","v":{"$error":"#N/A"}},{"$f":"IF(V83=\"\",\"\",(V83-W83)*60)","v":{"$error":"#N/A"}},{"$f":"IF(X83=\"\",\"\",ROUND(X83,0))","v":{"$error":"#N/A"}}]
[null,null,null,null,null,null,null,null,null,{"$f":"IF(H83=\"\",\"\",INDEX($S$1:$S$83,MAX(IF($S$1:$S$83<>\"\",ROW($S$1:$S$83))),1))","v":{"$error":"#N/A"}}]
["視準点","角　　度",null,null,null,null,null,null,null,"距　　離",null,null,null,"平面直角座標\n面上の距離","その他"]
[null,"水平角",null,null,"方向角",null,"高度角",null,null,"斜距離","球面距離","投影補正","縮尺補正",null,"時 間","目標高etc"]
[{"$f":"IF(B83=\"\",\"\",B83)","v":"Z40"},null,"0° 0′ 0″",null,{"$f":"IF(J83=\"\",\"\",J83)","v":{"$error":"#N/A"}},null,null,null,null,null,null,"補正あり","補正あり",{"$f":"IF(OR(F82=\"\",H82=\"\",F83=\"\",H83=\"\"),\"\",SQRT((F82-F83)^2+(H82-H83)^2))","v":{"$error":"#N/A"}},"07:15:00",null,"度",null,"分",null,"秒","10進法度","方向角(1)","決定方向角","度",null,"分",null,"秒"]
["P1",128.5959,{"$f":"IF(B88=\"\",\"\",Q88&\"°\"&S88&\"′\"&U88&\"″\")","v":"128°59′59″"},null,{"$f":"IF(OR(E87=\"\",C88=\"\"),\"\",Y88&\"°\"&AA88&\"′\"&AC88&\"″\")","v":{"$error":"#N/A"}},null,-9.3628999999999998,{"$f":"IF(G88=\"\",\"\",ABS(Q102)&\"°\"&ABS(S102)&\"′\"&ABS(U102)&\"″\")","v":"9°36′29″"},null,100,{"$f":"IF(H88=\"\",IF(J88=\"\",\"\",J88),IF($G$86=\"高度角\",ROUND(ABS(J88*COS(V102)),3),ROUND(ABS(J88*SIN(V102)),3)))","v":98.325000000000003},{"$f":"IF(OR($N$9=\"\",K88=\"\",$L$87=\"補正なし\"),\"\",ROUND(-$N$9*K88/6370000,3))","v":-1E-3},{"$f":"IF(OR($N$8=\"\",K88=\"\",$M$87=\"補正なし\"),\"\",IF(L88=\"\",ROUND(K88*($N$8-1),3),ROUND(AD88*($N$8-1),3)))","v":-0.01},{"$f":"IF(K88=\"\",\"\",SUM(K88:M88))","v":98.313999999999993},null,null,{"$f":"IF(B88=\"\",\"\",TRUNC(B88))","v":128},{"$f":"IF(Q88=\"\",\"\",(B88-Q88)*100)","v":59.590000000000032},{"$f":"IF(R88=\"\",\"\",TRUNC(R88))","v":59},{"$f":"IF(R88=\"\",\"\",(R88-S88)*100)","v":59.000000000003183},{"$f":"IF(T88=\"\",\"\",ROUND(T88,0))","v":59},{"$f":"IF(B88=\"\",\"\",Q88+S88/60+U88/3600)","v":128.9997222222222},{"$f":"$J$84+V88","v":{"$error":"#N/A"}},{"$f":"IF(W88>=360,W88-360,W88)","v":{"$error":"#N/A"}},{"$f":"IF(OR(E87=\"\",C88=\"\"),\"\",TRUNC(X88))","v":{"$error":"#N/A"}},{"$f":"IF(X88=\"\",\"\",(X88-Y88)*60)","v":{"$error":"#N/A"}},{"$f":"IF(Z88=\"\",\"\",TRUNC(Z88))","v":{"$error":"#N/A"}},{"$f":"IF(Z88=\"\",\"\",(Z88-AA88)*60)","v":{"$error":"#N/A"}},{"$f":"IF(AB88=\"\",\"\",ROUND(AB88,0))","v":{"$error":"#N/A"}},{"$f":"IF(OR(K88=\"\",L88=\"\",$L$87=\"補正なし\"),\"\",K88+L88)","v":98.323999999999998}]
["P2",1.2636000000000001,{"$f":"IF(B89=\"\",\"\",Q89&\"°\"&S89&\"′\"&U89&\"″\")","v":"1°26′36″"},null,{"$f":"IF(OR(E88=\"\",C89=\"\"),\"\",Y89&\"°\"&AA89&\"′\"&AC89&\"″\")","v":{"$error":"#N/A"}},null,12.3636,{"$f":"IF(G89=\"\",\"\",ABS(Q103)&\"°\"&ABS(S103)&\"′\"&ABS(U103)&\"″\")","v":"12°36′36″"},null,10,{"$f":"IF(H89=\"\",IF(J89=\"\",\"\",J89),IF($G$86=\"高度角\",ROUND(ABS(J89*COS(V103)),3),ROUND(ABS(J89*SIN(V103)),3)))","v":9.99},{"$f":"IF(OR($N$9=\"\",K89=\"\",$L$87=\"補正なし\"),\"\",ROUND(-$N$9*K89/6370000,3))","v":0},{"$f":"IF(OR($N$8=\"\",K89=\"\",$M$87=\"補正なし\"),\"\",IF(L89=\"\",ROUND(K89*($N$8-1),3),ROUND(AD89*($N$8-1),3)))","v":-1E-3},{"$f":"IF(K89=\"\",\"\",SUM(K89:M89))","v":9.9890000000000008},null,null,{"$f":"IF(B89=\"\",\"\",TRUNC(B89))","v":1},{"$f":"IF(Q89=\"\",\"\",(B89-Q89)*100)","v":26.360000000000007},{"$f":"IF(R89=\"\",\"\",TRUNC(R89))","v":26},{"$f":"IF(R89=\"\",\"\",(R89-S89)*100)","v":36.000000000000654},{"$f":"IF(T89=\"\",\"\",ROUND(T89,0))","v":36},{"$f":"IF(B89=\"\",\"\",Q89+S89/60+U89/3600)","v":1.4433333333333334},{"$f":"$J$84+V89","v":{"$error":"#N/A"}},{"$f":"IF(W89>=360,W89-360,W89)","v":{"$error":"#N/A"}},{"$f":"IF(OR(E88=\"\",C89=\"\"),\"\",TRUNC(X89))","v":{"$error":"#N/A"}},{"$f":"IF(X89=\"\",\"\",(X89-Y89)*60)","v":{"$error":"#N/A"}},{"$f":"IF(Z89=\"\",\"\",TRUNC(Z89))","v":{"$error":"#N/A"}},{"$f":"IF(Z89=\"\",\"\",(Z89-AA89)*60)","v":{"$error":"#N/A"}},{"$f":"IF(AB89=\"\",\"\",ROUND(AB89,0))","v":{"$error":"#N/A"}},9.99]
["P3",25.282800000000002,"25°28′28″",null,{"$f":"IF(OR(E89=\"\",C90=\"\"),\"\",Y90&\"°\"&AA90&\"′\"&AC90&\"″\")","v":{"$error":"#N/A"}},null,-12.3636,"12°36′36″",null,100,99.905000000000001,-1E-3,{"$f":"IF(OR($N$8=\"\",K90=\"\",$M$87=\"補正なし\"),\"\",IF(L90=\"\",ROUND(K90*($N$8-1),3),ROUND(AD90*($N$8-1),3)))","v":-0.01},99.893999999999991,null,null,25,28.280000000000172,28,28.000000000017167,28,25.474444444444444,{"$f":"$J$84+V90","v":{"$error":"#N/A"}},{"$error":"#N/A"},{"$error":"#N/A"},{"$error":"#N/A"},{"$error":"#N/A"},{"$error":"#N/A"},{"$error":"#N/A"},99.903999999999996]
["P4",3.2536,"3°25′36″",null,{"$error":"#N/A"},null,9.3628999999999998,"9°36′29″",null,100,98.325000000000003,{"$f":"IF(OR($N$9=\"\",K91=\"\",$L$87=\"補正なし\"),\"\",ROUND(-$N$9*K91/6370000,3))","v":-1E-3},-0.01,98.313999999999993,null,null,3,25.360000000000007,25,36.000000000000654,36,3.4266666666666663,{"$error":"#N/A"},{"$error":"#N/A"},{"$error":"#N/A"},{"$error":"#N/A"},{"$error":"#N/A"},{"$error":"#N/A"},{"$error":"#N/A"},98.323999999999998]
["P5",4.2336,"4°23′36″",null,{"$error":"#N/A"},null,null,"",null,100,100,{"$f":"IF(OR($N$9=\"\",K92=\"\",$L$87=\"補正なし\"),\"\",ROUND(-$N$9*K92/6370000,3))","v":-1E-3},-0.01,99.98899999999999,null,null,4,23.360000000000003,23,36.000000000000298,36,4.3933333333333335,{"$error":"#N/A"},{"$error":"#N/A"},{"$error":"#N/A"},{"$error":"#N/A"},{"$error":"#N/A"},{"$error":"#N/A"},{"$error":"#N/A"},99.998999999999995]
["P6",3.3029999999999999,"3°30′30″",null,{"$error":"#N/A"},null,null,"",null,100,100,-1E-3,{"$f":"IF(OR($N$8=\"\",K93=\"\",$M$87=\"補正なし\"),\"\",IF(L93=\"\",ROUND(K93*($N$8-1),3),ROUND(AD93*($N$8-1),3)))","v":-0.01},99.98899999999999,null,null,3,30.299999999999994,30,29.999999999999361,30,3.5083333333333333,{"$error":"#N/A"},{"$error":"#N/A"},{"$error":"#N/A"},{"$error":"#N/A"},{"$error":"#N/A"},{"$error":"#N/A"},{"$error":"#N/A"},99.998999999999995]
["P7",5.3029999999999999,"5°30′30″",null,{"$error":"#N/A"},null,null,"",null,100,100,-1E-3,-0.01,99.98899999999999,null,null,5,30.299999999999994,30,29.999999999999361,30,5.5083333333333337,{"$error":"#N/A"},{"$error":"#N/A"},{"$error":"#N/A"},{"$error":"#N/A"},{"$error":"#N/A"},{"$error":"#N/A"},{"$error":"#N/A"},99.998999999999995]
["P8",5,"5°0′0″",null,{"$error":"#N/A"},null,null,"",null,100,100,-1E-3,-0.01,99.98899999999999,null,null,5,0,0,0,0,5,{"$error":"#N/A"},{"$error":"#N/A"},{"$error":"#N/A"},{"$error":"#N/A"},{"$error":"#N/A"},{"$error":"#N/A"},{"$error":"#N/A"},99.998999999999995]
["P9",359,"359°0′0″",null,{"$error":"#N/A"},null,null,"",null,100,100,-1E-3,-0.01,99.98899999999999,null,null,359,0,0,0,0,359,{"$error":"#N/A"},{"$error":"#N/A"},{"$error":"#N/A"},{"$error":"#N/A"},{"$error":"#N/A"},{"$error":"#N/A"},{"$error":"#N/A"},99.998999999999995]
["P10",1.2536,"1°25′36″",null,{"$error":"#N/A"},null,null,"",null,100,100,-1E-3,-0.01,99.98899999999999,"14:25:00",null,1,25.360000000000007,25,36.000000000000654,36,1.4266666666666667,{"$error":"#N/A"},{"$error":"#N/A"},{"$error":"#N/A"},{"$error":"#N/A"},{"$error":"#N/A"},{"$error":"#N/A"},{"$error":"#N/A"},99.998999999999995]
[null,null,null,null,null,null,null,null,null,null,null,"※投影補正にジオイド高は考慮してません。"]
["《 座標計算書 》"]
[]
["視準点","X座標",null,null,"Y座標",null,"標　高",null,"その他",null,null,"記　号","標識の種類",null,null,null,"度",null,"分",null,"秒","10進法度"]
[{"$f":"IF(A88=\"\",\"\",A88)","v":"P1"},{"$f":"IF(OR(C88=\"\",N88=\"\",$F$82=\"\"),\"\",$F$82+N88*COS(X88))","v":{"$error":"#N/A"}},null,null,{"$f":"IF(OR($H$82=\"\",C88=\"\",N88=\"\"),\"\",$H$82+N88*SIN(V88))","v":{"$error":"#N/A"}},null,null,null,null,null,null,"M","ミカゲ石",null,null,null,{"$f":"IF(G88=\"\",\"\",TRUNC(G88))","v":-9},{"$f":"IF(G88=\"\",\"\",(G88-Q102)*100)","v":-36.289999999999978},{"$f":"IF(R102=\"\",\"\",TRUNC(R102))","v":-36},{"$f":"IF(R102=\"\",\"\",(R102-S102)*100)","v":-28.999999999997783},{"$f":"IF(T102=\"\",\"\",ROUND(T102,0))","v":-29},{"$f":"IF(G88=\"\",\"\",Q102+S102/60+U102/3600)","v":-9.6080555555555556}]
[{"$f":"IF(A89=\"\",\"\",A89)","v":"P2"},{"$f":"IF(OR(C89=\"\",N89=\"\",$F$82=\"\"),\"\",$F$82+N89*COS(X89))","v":{"$error":"#N/A"}},null,null,{"$f":"IF(OR($H$82=\"\",C89=\"\",N89=\"\"),\"\",$H$82+N89*SIN(V89))","v":{"$error":"#N/A"}},null,null,null,null,null,null,"C","コンクリート杭",null,null,null,{"$f":"IF(G89=\"\",\"\",TRUNC(G89))","v":12},{"$f":"IF(G89=\"\",\"\",(G89-Q103)*100)","v":36.359999999999992},{"$f":"IF(R103=\"\",\"\",TRUNC(R103))","v":36},{"$f":"IF(R103=\"\",\"\",(R103-S103)*100)","v":35.999999999999233},{"$f":"IF(T103=\"\",\"\",ROUND(T103,0))","v":36},{"$f":"IF(G89=\"\",\"\",Q103+S103/60+U103/3600)","v":12.61}]
["P3",{"$error":"#N/A"},null,null,{"$f":"IF(OR($H$82=\"\",C90=\"\",N90=\"\"),\"\",$H$82+N90*SIN(V90))","v":{"$error":"#N/A"}},null,null,null,null,null,null,"S","真鍮製金属標",null,null,null,-12,-36.359999999999992,-36,-35.999999999999233,-36,-12.61]
["P4",{"$f":"IF(OR(C91=\"\",N91=\"\",$F$82=\"\"),\"\",$F$82+N91*COS(X91))","v":{"$error":"#N/A"}},null,null,{"$f":"IF(OR($H$82=\"\",C91=\"\",N91=\"\"),\"\",$H$82+N91*SIN(V91))","v":{"$error":"#N/A"}},null,null,null,null,null,null,"B","金属鋲",null,null,null,9,36.289999999999978,36,28.999999999997783,29,9.6080555555555556]
["P5",{"$error":"#N/A"},null,null,{"$error":"#N/A"},null,null,null,null,null,null,"P","プレート板",null,null,null,"","","","","",""]
["P6",{"$error":"#N/A"},null,null,{"$error":"#N/A"},null,null,null,null,null,null,"T","木杭",null,null,null,"","","","","",""]
["P7",{"$error":"#N/A"},null,null,{"$error":"#N/A"},null,null,null,null,null,null,"K","刻み",null,null,null,"","","","","",""]
["P8",{"$error":"#N/A"},null,null,{"$error":"#N/A"},null,null,null,null,null,null,null,null,null,null,null,"","","","","",""]
["P9",{"$error":"#N/A"},null,null,{"$error":"#N/A"},null,null,null,null,null,null,null,null,null,null,null,"","","","","",""]
["P10",{"$error":"#N/A"},null,null,{"$error":"#N/A"},null,null,null,null,null,null,null,{"$f":"座標入力!$J$3","v":"C04O05K05U00DS1"},null,{"$f":"O37","v":"座標入力使用者に名前入力"},null,"","","","","",""]