{"text_format":"1","workbook":"xlsx","n_sheets":5,"sheets":["座標入力","面積計算","2点間距離","逆計算","放射トラバース"],"not_rendered":{"charts":0,"images":0,"macros":1,"external_links":0,"defined_names":3,"comments":5,"pivot_tables":0},"unopened":[],"bounds":{"document_bytes":16777216,"sheet_cells":100000,"rows_first":2000,"rows_last":500,"rows_between":2000,"halvings":0,"cell_chars":16384,"cell_head_chars":4096},"cells_cut":0,"cells_raw":0,"read":"whole","date_system":"1900"}

{"sheet":"座標入力","index":0,"n_rows":402,"n_cols":10,"rows_kept":402,"cut":false,"hidden":false,"merged":[[0,1,0,2],[3,9,3,10],[2,9,2,10],[0,4,0,7]]}
[null,"座 標 入 力",null,"件名：","福岡市○○区△△町１丁目地内道路測量"]
["NO","測点","Ｘ","Ｙ","標　高","備　考"]
[1,null,null,null,null,null,null,null,"シリアル番号","C04O05K05U00DS1"]
[2,null,null,null,null,null,null,null,"使　用　者","座標入力使用者に名前入力"]
[3]
[4]
[5]
[6]
[7]
[8]
{"$rows_left_out":393}
{"sheet":"面積計算","index":1,"n_rows":185,"n_cols":9,"rows_kept":185,"cut":false,"hidden":false,"merged":[[62,0,62,1],[64,0,64,1],[63,0,63,1],[60,0,60,1],[184,0,184,1],[65,0,65,1],[66,0,66,1],[67,0,67,1],[68,0,68,1],[183,0,183,1],[69,0,69,1],[70,0,70,1],[71,0,71,1],[72,0,72,1],[0,3,0,5],[48,0,48,1],[57,0,57,1],[51,0,51,1],[52,0,52,1],[53,0,53,1],[54,0,54,1],[49,0,49,1],[55,0,55,1],[56,0,56,1],[1,1,1,5],[60,3,60,5],[34,0,34,1],[35,0,35,1],[36,0,36,1],[37,0,37,1],[22,0,22,1],[23,0,23,1],[21,0,21,1],[2,2,2,6],[5,2,5,4],[16,0,16,1],[17,0,17,1],[2,0,3,0],[6,0,6,1],[7,0,7,1],[28,0,28,1],[29,0,29,1],[12,0,12,1],[38,0,38,1],[25,0,25,1],[24,0,24,1],[31,0,31,1],[32,0,32,1],[30,0,30,1],[27,0,27,1],[19,0,19,1],[20,0,20,1],[73,0,73,1],[74,0,74,1],[14,0,14,1],[15,0,15,1],[5,0,5,1],[8,0,8,1],[33,0,33,1],[26,0,26,1],[50,0,50,1],[39,0,39,1],[40,0,40,1],[41,0,41,1],[42,0,42,1],[43,0,43,1],[45,0,45,1],[44,0,44,1],[46,0,46,1],[47,0,47,1],[58,0,58,1],[59,0,59,1],[81,0,81,1],[82,0,82,1],[83,0,83,1],[84,0,84,1],[85,0,85,1],[86,0,86,1],[75,0,75,1],[76,0,76,1],[77,0,77,1],[78,0,78,1],[79,0,79,1],[80,0,80,1],[106,0,106,1],[107,0,107,1],[93,0,93,1],[94,0,94,1],[95,0,95,1],[96,0,96,1],[97,0,97,1],[98,0,98,1],[87,0,87,1],[88,0,88,1],[89,0,89,1],[90,0,90,1],[91,0,91,1],[92,0,92,1],[128,0,128,1],[129,0,129,1],[125,0,125,1],[126,0,126,1],[127,0,127,1],[130,0,130,1],[124,0,124,1],[181,0,181,1],[182,0,182,1],[151,0,151,1],[152,0,152,1],[137,0,137,1],[138,0,138,1],[139,0,139,1],[140,0,140,1],[141,0,141,1],[142,0,142,1],[131,0,131,1],[132,0,132,1],[133,0,133,1],[134,0,134,1],[135,0,135,1],[136,0,136,1],[180,0,180,1],[111,0,111,1],[112,0,112,1],[113,0,113,1],[115,0,115,1],[179,0,179,1],[175,0,175,1],[176,0,176,1],[167,0,167,1],[168,0,168,1],[169,0,169,1],[170,0,170,1],[171,0,171,1],[172,0,172,1],[161,0,161,1],[162,0,162,1],[163,0,163,1],[164,0,164,1],[165,0,165,1],[166,0,166,1],[155,0,155,1],[156,0,156,1],[157,0,157,1],[158,0,158,1],[177,0,177,1],[178,0,178,1],[123,2,123,3],[61,0,61,1],[61,2,61,3],[109,0,109,1],[110,0,110,1],[123,0,123,1],[122,0,122,1],[105,0,105,1],[173,0,173,1],[174,0,174,1],[159,0,159,1],[160,0,160,1],[154,0,154,1],[147,0,147,1],[148,0,148,1],[149,0,149,1],[150,0,150,1],[153,0,153,1],[143,0,143,1],[144,0,144,1],[145,0,145,1],[146,0,146,1],[2,11,2,12],[3,11,3,12],[61,4,61,5],[123,4,123,5],[4,0,4,6],[18,0,18,1],[10,0,10,1],[11,0,11,1],[9,0,9,1],[13,0,13,1],[114,0,114,1],[118,0,118,1],[119,0,119,1],[120,0,120,1],[117,0,117,1],[116,0,116,1],[121,0,121,1],[99,0,99,1],[100,0,100,1],[108,0,108,1],[101,0,101,1],[102,0,102,1],[103,0,103,1],[104,0,104,1]]}
[null,null,null,"座標面積計算書",null,null,{"$f":"IF(I11=0,\"\",IF(AND(I8<>0,I9=0),\"(1/1)\",IF(AND(I9<>0,I10=0),\"(1/2)\",\"(1/3)\")))","v":""}]
[{"$f":"座標入力!$D$1","v":"件名："},{"$f":"座標入力!$E$1","v":"福岡市○○区△△町１丁目地内道路測量"},null,null,null,null,"2016-06-16"]
["土地の\n表　示","所 在"]
[null,"地 目",null,"地　積",null,"所 有 者"]
[]
["種　   別",null,"道路用地拡幅の為",null,null,"計 算 者","博多花子"]
["測　　　点",null,"Ｘ","Ｙ","距　　　離","Ｘｎ+1－Ｘｎ-1","Ｙ(Ｘｎ+1－Ｘｎ-1)"]
[null,null,{"$f":"IF(A8=\"\",\"\",VLOOKUP(A8,座標入力!$B$3:$D$402,2,FALSE))","v":""},{"$f":"IF(A8=\"\",\"\",VLOOKUP(A8,座標入力!$B$3:$D$402,3,FALSE))","v":""},{"$f":"IF(OR(C8=\"\",A9=\"\"),\"\",ROUND(IF(AND(C9=\"\",D9=\"\"),SQRT(($C$8-C8)^2+($D$8-D8)^2),SQRT((C9-C8)^2+(D9-D8)^2)),3))","v":""},{"$f":"IF(OR(A8=\"\",A9=\"\"),\"\",IF(AND(I9=0,I10=0),$C$9-INDEX($C$8:C57,MAX(IF($C$8:C57<>\"\",ROW($C$8:C57)-7)),1),\nIF(AND(I9<>0,I10=0),$C$9-INDEX($C$64:C119,MAX(IF($C$64:C119<>\"\",ROW($C$64:C119)-63)),1),$C$9-INDEX($C$126:C181,MAX(IF($C$126:C181<>\"\",ROW($C$126:C181)-125)),1))))","v":""},{"$f":"IF(OR(D8=\"\",F8=\"\"),\"\",D8*F8)","v":""},null,{"$f":"COUNTA(A8:B57)","v":0}]
[null,null,{"$f":"IF(A9=\"\",\"\",VLOOKUP(A9,座標入力!$B$3:$D$402,2,FALSE))","v":""},{"$f":"IF(A9=\"\",\"\",VLOOKUP(A9,座標入力!$B$3:$D$402,3,FALSE))","v":""},{"$f":"IF(C9=\"\",\"\",ROUND(IF(AND(C10=\"\",D10=\"\"),SQRT(($C$8-C9)^2+($D$8-D9)^2),SQRT((C10-C9)^2+(D10-D9)^2)),3))","v":""},{"$f":"IF(C9=\"\",\"\",IF(C10=\"\",$C$8-C8,C10-C8))","v":""},{"$f":"IF(OR(D9=\"\",F9=\"\"),\"\",D9*F9)","v":""},null,{"$f":"COUNTA(A64:B119)","v":0}]
[null,null,{"$f":"IF(A10=\"\",\"\",VLOOKUP(A10,座標入力!$B$3:$D$402,2,FALSE))","v":""},{"$f":"IF(A10=\"\",\"\",VLOOKUP(A10,座標入力!$B$3:$D$402,3,FALSE))","v":""},"",{"$f":"IF(C10=\"\",\"\",IF(C11=\"\",$C$8-C9,C11-C9))","v":""},"",null,{"$f":"COUNTA(A126:B180)","v":0}]
{"$rows_left_out":176}
{"sheet":"2点間距離","index":2,"n_rows":55,"n_cols":11,"rows_kept":55,"cut":false,"hidden":false,"merged":[[0,0,0,2],[2,12,2,13],[3,12,3,13],[1,1,1,3]]}
["２点間距離計算書"]
[{"$f":"面積計算!A2","v":"件名："},{"$f":"面積計算!B2","v":"福岡市○○区△△町１丁目地内道路測量"}]
["2003-05-06",null,null,"博多花子"]
["測点１","測点２","２点間距離","備　考",null,"測1のX","測1のY","測2のX","測2のY","Ｘの差","Ｙの差"]
[null,null,{"$f":"IF(OR(A5=\"\",B5=\"\"),\"\",SQRT(J5+K5))","v":""},null,null,{"$f":"IF(A5=\"\",\"\",VLOOKUP(A5,座標入力!$B$3:$D$402,2,FALSE))","v":""},{"$f":"IF(A5=\"\",\"\",VLOOKUP(A5,座標入力!$B$3:$D$402,3,FALSE))","v":""},{"$f":"IF(B5=\"\",\"\",VLOOKUP(B5,座標入力!$B$3:$D$402,2,FALSE))","v":""},{"$f":"IF(B5=\"\",\"\",VLOOKUP(B5,座標入力!$B$3:$D$402,3,FALSE))","v":""},{"$f":"IF(OR(F5=\"\",H5=\"\"),\"\",(F5-H5)^2)","v":""},{"$f":"IF(OR(G5=\"\",I5=\"\"),\"\",(G5-I5)^2)","v":""}]
[null,null,{"$f":"IF(OR(A6=\"\",B6=\"\"),\"\",SQRT(J6+K6))","v":""},null,null,{"$f":"IF(A6=\"\",\"\",VLOOKUP(A6,座標入力!$B$3:$D$402,2,FALSE))","v":""},{"$f":"IF(A6=\"\",\"\",VLOOKUP(A6,座標入力!$B$3:$D$402,3,FALSE))","v":""},{"$f":"IF(B6=\"\",\"\",VLOOKUP(B6,座標入力!$B$3:$D$402,2,FALSE))","v":""},{"$f":"IF(B6=\"\",\"\",VLOOKUP(B6,座標入力!$B$3:$D$402,3,FALSE))","v":""},{"$f":"IF(OR(F6=\"\",H6=\"\"),\"\",(F6-H6)^2)","v":""},{"$f":"IF(OR(G6=\"\",I6=\"\"),\"\",(G6-I6)^2)","v":""}]
[null,null,"",null,null,{"$f":"IF(A7=\"\",\"\",VLOOKUP(A7,座標入力!$B$3:$D$402,2,FALSE))","v":""},{"$f":"IF(A7=\"\",\"\",VLOOKUP(A7,座標入力!$B$3:$D$402,3,FALSE))","v":""},{"$f":"IF(B7=\"\",\"\",VLOOKUP(B7,座標入力!$B$3:$D$402,2,FALSE))","v":""},{"$f":"IF(B7=\"\",\"\",VLOOKUP(B7,座標入力!$B$3:$D$402,3,FALSE))","v":""},"",""]
[null,null,"",null,null,{"$f":"IF(A8=\"\",\"\",VLOOKUP(A8,座標入力!$B$3:$D$402,2,FALSE))","v":""},{"$f":"IF(A8=\"\",\"\",VLOOKUP(A8,座標入力!$B$3:$D$402,3,FALSE))","v":""},{"$f":"IF(B8=\"\",\"\",VLOOKUP(B8,座標入力!$B$3:$D$402,2,FALSE))","v":""},{"$f":"IF(B8=\"\",\"\",VLOOKUP(B8,座標入力!$B$3:$D$402,3,FALSE))","v":""},"",""]
[null,null,"",null,null,{"$f":"IF(A9=\"\",\"\",VLOOKUP(A9,座標入力!$B$3:$D$402,2,FALSE))","v":""},{"$f":"IF(A9=\"\",\"\",VLOOKUP(A9,座標入力!$B$3:$D$402,3,FALSE))","v":""},{"$f":"IF(B9=\"\",\"\",VLOOKUP(B9,座標入力!$B$3:$D$402,2,FALSE))","v":""},{"$f":"IF(B9=\"\",\"\",VLOOKUP(B9,座標入力!$B$3:$D$402,3,FALSE))","v":""},"",""]
[null,null,"",null,null,{"$f":"IF(A10=\"\",\"\",VLOOKUP(A10,座標入力!$B$3:$D$402,2,FALSE))","v":""},{"$f":"IF(A10=\"\",\"\",VLOOKUP(A10,座標入力!$B$3:$D$402,3,FALSE))","v":""},{"$f":"IF(B10=\"\",\"\",VLOOKUP(B10,座標入力!$B$3:$D$402,2,FALSE))","v":""},{"$f":"IF(B10=\"\",\"\",VLOOKUP(B10,座標入力!$B$3:$D$402,3,FALSE))","v":""},"",""]
{"$rows_left_out":46}
{"sheet":"逆計算","index":3,"n_rows":45,"n_cols":28,"rows_kept":45,"cut":false,"hidden":false,"merged":[[4,29,4,30],[0,0,0,4],[2,0,2,2],[3,0,3,1],[1,1,1,4],[3,29,3,30],[44,1,44,2],[31,0,31,1],[17,0,17,1],[16,1,16,2],[30,1,30,2]]}
["復元(放射逆トラバース)計算書"]
[{"$f":"面積計算!A2","v":"件名："},{"$f":"面積計算!B2","v":"福岡市○○区△△町１丁目地内道路測量"}]
["2003-05-20",null,null,null,"博多花子"]
["測     点",null,"方 向 角","夾　角","距　離",null,"Ｘ","Ｙ"]
["器械点",null,"-","-","-",null,{"$f":"IF(B5=\"\",\"\",VLOOKUP(B5,座標入力!$B$3:$D$402,2,FALSE))","v":""},{"$f":"IF(B5=\"\",\"\",VLOOKUP(B5,座標入力!$B$3:$D$402,3,FALSE))","v":""},"⊿Ｘ","⊿Ｙ","角度1","角度2","度",null,null,"分",null,null,"秒",null,null,"度",null,null,"分",null,null,"分"]
["零方向",null,{"$f":"TEXT(M6,\"#,##0-\")&TEXT(P6,\"#00-\")&TEXT(S6,\"#00\")","v":""},{"$f":"TEXT(V6,\"#,##0-\")&TEXT(Y6,\"#00-\")&TEXT(AB6,\"#00\")","v":""},{"$f":"IF(OR(I6=\"\",J6=\"\"),\"\",SQRT(I6^2+J6^2))","v":""},null,{"$f":"IF(B6=\"\",\"\",VLOOKUP(B6,座標入力!$B$3:$D$402,2,FALSE))","v":""},{"$f":"IF(B6=\"\",\"\",VLOOKUP(B6,座標入力!$B$3:$D$402,3,FALSE))","v":""},{"$f":"IF(OR($G$5=\"\",G6=\"\"),\"\",G6-$G$5)","v":""},{"$f":"IF(OR($H$5=\"\",H6=\"\"),\"\",H6-$H$5)","v":""},{"$f":"IF(OR(I6=\"\",J6=\"\"),\"\",ATAN2(I6,J6)*(180/PI()))","v":""},{"$f":"IF(K6=\"\",\"\",(IF(K6<0,360+K6,K6)))","v":""},{"$f":"IF(L6=\"\",\"\",TRUNC(L6))","v":""},{"$f":"IF(M6=\"\",\"\",L6-M6)","v":""},{"$f":"IF(N6=\"\",\"\",N6*60)","v":""},{"$f":"IF(O6=\"\",\"\",TRUNC(O6))","v":""},{"$f":"IF(P6=\"\",\"\",O6-P6)","v":""},{"$f":"IF(Q6=\"\",\"\",Q6*60)","v":""},{"$f":"IF(R6=\"\",\"\",TRUNC(R6))","v":""},{"$f":"IF(L6=\"\",\"\",L6-$L$6)","v":""},{"$f":"IF(T6=\"\",\"\",T6)","v":""},{"$f":"IF(U6=\"\",\"\",TRUNC(U6))","v":""},{"$f":"IF(V6=\"\",\"\",U6-V6)","v":""},{"$f":"IF(W6=\"\",\"\",W6*60)","v":""},{"$f":"IF(X6=\"\",\"\",TRUNC(X6))","v":""},{"$f":"IF(Y6=\"\",\"\",X6-Y6)","v":""},{"$f":"IF(Z6=\"\",\"\",Z6*60)","v":""},{"$f":"IF(AA6=\"\",\"\",TRUNC(AA6))","v":""}]
["復元 1",null,"",{"$f":"TEXT(V7,\"#,##0-\")&TEXT(Y7,\"#00-\")&TEXT(AB7,\"#00\")","v":""},{"$f":"IF(OR(I7=\"\",J7=\"\"),\"\",SQRT(I7^2+J7^2))","v":""},null,{"$f":"IF(B7=\"\",\"\",VLOOKUP(B7,座標入力!$B$3:$D$402,2,FALSE))","v":""},{"$f":"IF(B7=\"\",\"\",VLOOKUP(B7,座標入力!$B$3:$D$402,3,FALSE))","v":""},{"$f":"IF(OR($G$5=\"\",G7=\"\"),\"\",G7-$G$5)","v":""},{"$f":"IF(OR($H$5=\"\",H7=\"\"),\"\",H7-$H$5)","v":""},{"$f":"IF(OR(I7=\"\",J7=\"\"),\"\",ATAN2(I7,J7)*(180/PI()))","v":""},{"$f":"IF(K7=\"\",\"\",(IF(K7<0,360+K7,K7)))","v":""},{"$f":"IF(L7=\"\",\"\",TRUNC(L7))","v":""},{"$f":"IF(M7=\"\",\"\",L7-M7)","v":""},{"$f":"IF(N7=\"\",\"\",N7*60)","v":""},{"$f":"IF(O7=\"\",\"\",TRUNC(O7))","v":""},{"$f":"IF(P7=\"\",\"\",O7-P7)","v":""},{"$f":"IF(Q7=\"\",\"\",Q7*60)","v":""},{"$f":"IF(R7=\"\",\"\",TRUNC(R7))","v":""},"",{"$f":"IF(T7=\"\",\"\",IF(T7<0,(360+T7),T7))","v":""},{"$f":"IF(U7=\"\",\"\",TRUNC(U7))","v":""},{"$f":"IF(V7=\"\",\"\",U7-V7)","v":""},{"$f":"IF(W7=\"\",\"\",W7*60)","v":""},{"$f":"IF(X7=\"\",\"\",TRUNC(X7))","v":""},{"$f":"IF(Y7=\"\",\"\",X7-Y7)","v":""},{"$f":"IF(Z7=\"\",\"\",Z7*60)","v":""},{"$f":"IF(AA7=\"\",\"\",TRUNC(AA7))","v":""}]
["復元 2",null,"","","",null,{"$f":"IF(B8=\"\",\"\",VLOOKUP(B8,座標入力!$B$3:$D$402,2,FALSE))","v":""},{"$f":"IF(B8=\"\",\"\",VLOOKUP(B8,座標入力!$B$3:$D$402,3,FALSE))","v":""},"","","","","","","","","","","","",{"$f":"IF(T8=\"\",\"\",IF(T8<0,(360+T8),T8))","v":""},{"$f":"IF(U8=\"\",\"\",TRUNC(U8))","v":""},{"$f":"IF(V8=\"\",\"\",U8-V8)","v":""},{"$f":"IF(W8=\"\",\"\",W8*60)","v":""},{"$f":"IF(X8=\"\",\"\",TRUNC(X8))","v":""},"",{"$f":"IF(Z8=\"\",\"\",Z8*60)","v":""},""]
["復元 3",null,"","","",null,{"$f":"IF(B9=\"\",\"\",VLOOKUP(B9,座標入力!$B$3:$D$402,2,FALSE))","v":""},{"$f":"IF(B9=\"\",\"\",VLOOKUP(B9,座標入力!$B$3:$D$402,3,FALSE))","v":""},"","","","","","","","","","","","","","","","","","","",""]
["復元 4",null,"","","",null,{"$f":"IF(B10=\"\",\"\",VLOOKUP(B10,座標入力!$B$3:$D$402,2,FALSE))","v":""},{"$f":"IF(B10=\"\",\"\",VLOOKUP(B10,座標入力!$B$3:$D$402,3,FALSE))","v":""},"","","","","","","","","","","","","","","","","","","",""]
{"$rows_left_out":36}
{"sheet":"放射トラバース","index":4,"n_rows":111,"n_cols":30,"rows_kept":111,"cut":false,"hidden":false,"merged":[[23,11,23,15],[97,11,97,15],[8,31,8,32],[9,31,9,32],[10,14,10,15],[32,12,32,13],[33,12,33,13],[26,12,26,13],[27,12,27,13],[2,1,2,14],[7,7,7,8],[8,7,8,8],[8,1,8,2],[6,7,6,8],[0,2,0,12],[4,1,4,3],[1,0,1,2],[13,2,13,3],[13,4,13,5],[13,7,13,8],[10,1,10,8],[12,2,12,3],[12,4,12,5],[12,7,12,8],[11,4,11,5],[11,6,11,8],[14,2,14,3],[14,4,14,5],[14,7,14,8],[15,2,15,3],[15,4,15,5],[10,0,11,0],[6,5,6,6],[7,5,7,6],[8,5,8,6],[11,1,11,3],[6,0,6,2],[7,1,7,2],[15,7,15,8],[21,2,21,3],[21,4,21,5],[21,7,21,8],[18,2,18,3],[18,4,18,5],[18,7,18,8],[17,2,17,3],[17,4,17,5],[17,7,17,8],[20,2,20,3],[20,4,20,5],[20,7,20,8],[19,2,19,3],[19,4,19,5],[19,7,19,8],[16,2,16,3],[16,4,16,5],[16,7,16,8],[28,8,28,9],[27,4,27,5],[27,6,27,7],[22,2,22,3],[22,4,22,5],[22,7,22,8],[24,0,24,2],[26,8,26,9],[27,8,27,9],[26,1,26,3],[26,6,26,7],[27,1,27,3],[29,1,29,3],[29,4,29,5],[29,6,29,7],[28,1,28,3],[28,4,28,5],[28,6,28,7],[26,4,26,5],[32,1,32,3],[32,4,32,5],[32,6,32,7],[32,8,32,9],[33,1,33,3],[33,4,33,5],[33,6,33,7],[33,8,33,9],[29,8,29,9],[30,1,30,3],[30,4,30,5],[30,6,30,7],[30,8,30,9],[31,1,31,3],[31,4,31,5],[31,6,31,7],[31,8,31,9],[36,8,36,9],[35,1,35,3],[35,4,35,5],[35,6,35,7],[35,8,35,9],[34,1,34,3],[34,4,34,5],[34,6,34,7],[34,8,34,9],[49,2,49,3],[49,4,49,5],[49,7,49,8],[50,2,50,3],[50,4,50,5],[50,7,50,8],[47,0,48,0],[47,1,47,8],[47,14,47,15],[48,1,48,3],[48,4,48,5],[48,6,48,8],[53,2,53,3],[53,4,53,5],[53,7,53,8],[54,2,54,3],[54,4,54,5],[54,7,54,8],[51,2,51,3],[51,4,51,5],[51,7,51,8],[52,2,52,3],[52,4,52,5],[52,7,52,8],[57,2,57,3],[57,4,57,5],[57,7,57,8],[58,2,58,3],[58,4,58,5],[58,7,58,8],[55,2,55,3],[55,4,55,5],[55,7,55,8],[56,2,56,3],[56,4,56,5],[56,7,56,8],[59,2,59,3],[59,4,59,5],[59,7,59,8],[61,0,61,2],[63,12,63,13],[64,1,64,3],[64,4,64,5],[64,6,64,7],[64,8,64,9],[64,12,64,13],[60,11,60,15],[63,1,63,3],[63,4,63,5],[63,6,63,7],[63,8,63,9],[65,12,65,13],[66,1,66,3],[66,4,66,5],[66,6,66,7],[66,8,66,9],[66,12,66,13],[65,1,65,3],[65,4,65,5],[65,6,65,7],[65,8,65,9],[67,12,67,13],[68,1,68,3],[68,4,68,5],[68,6,68,7],[68,8,68,9],[68,12,68,13],[67,1,67,3],[67,4,67,5],[67,6,67,7],[67,8,67,9],[69,12,69,13],[70,1,70,3],[70,4,70,5],[70,6,70,7],[70,8,70,9],[70,12,70,13],[72,1,72,3],[72,4,72,5],[72,6,72,7],[72,8,72,9],[73,1,73,3],[73,4,73,5],[73,6,73,7],[73,8,73,9],[69,1,69,3],[69,4,69,5],[69,6,69,7],[69,8,69,9],[71,1,71,3],[71,4,71,5],[71,6,71,7],[71,8,71,9],[81,1,81,2],[81,5,81,6],[81,7,81,8],[82,1,82,2],[82,5,82,6],[82,7,82,8],[74,2,74,12],[75,0,75,2],[76,1,76,14],[78,1,78,3],[80,0,80,2],[80,5,80,6],[80,7,80,8],[86,2,86,3],[86,4,86,5],[86,7,86,8],[87,2,87,3],[87,4,87,5],[87,7,87,8],[84,0,85,0],[84,1,84,8],[84,14,84,15],[85,1,85,3],[85,4,85,5],[85,6,85,8],[84,9,84,12],[84,13,85,13],[90,2,90,3],[90,4,90,5],[90,7,90,8],[91,2,91,3],[91,4,91,5],[91,7,91,8],[88,2,88,3],[88,4,88,5],[88,7,88,8],[89,2,89,3],[89,4,89,5],[89,7,89,8],[94,2,94,3],[94,4,94,5],[94,7,94,8],[95,2,95,3],[95,4,95,5],[95,7,95,8],[92,2,92,3],[92,4,92,5],[92,7,92,8],[93,2,93,3],[93,4,93,5],[93,7,93,8],[96,2,96,3],[96,4,96,5],[96,7,96,8],[98,0,98,2],[100,12,100,13],[101,1,101,3],[101,4,101,5],[101,6,101,7],[101,8,101,9],[101,12,101,13],[100,1,100,3],[100,4,100,5],[100,6,100,7],[100,8,100,9],[102,12,102,13],[103,1,103,3],[103,4,103,5],[103,6,103,7],[103,8,103,9],[103,12,103,13],[105,1,105,3],[105,4,105,5],[105,6,105,7],[105,8,105,9],[106,1,106,3],[106,4,106,5],[106,6,106,7],[106,8,106,9],[102,1,102,3],[102,4,102,5],[102,6,102,7],[102,8,102,9],[104,1,104,3],[104,4,104,5],[104,6,104,7],[104,8,104,9],[109,1,109,3],[109,4,109,5],[109,6,109,7],[109,8,109,9],[110,1,110,3],[110,4,110,5],[110,6,110,7],[110,8,110,9],[107,1,107,3],[107,4,107,5],[107,6,107,7],[107,8,107,9],[108,1,108,3],[108,4,108,5],[108,6,108,7],[108,8,108,9],[110,12,110,13],[110,14,110,15],[36,14,36,15],[36,12,36,13],[73,12,73,13],[73,14,73,15],[106,12,106,13],[107,12,107,13],[104,12,104,13],[105,12,105,13],[10,9,10,12],[10,13,11,13],[47,9,47,12],[47,13,48,13],[37,2,37,12],[38,0,38,2],[39,1,39,14],[41,1,41,3],[30,12,30,13],[31,12,31,13],[44,1,44,2],[44,5,44,6],[44,7,44,8],[45,1,45,2],[45,5,45,6],[45,7,45,8],[28,12,28,13],[29,12,29,13],[43,0,43,2],[43,5,43,6],[43,7,43,8],[36,1,36,3],[36,4,36,5],[36,6,36,7]]}
[null,null,"放射トラバース測量"]
["《 観測手簿 》",null,null,{"$f":"IF(OR(B8=\"\",B9=\"\"),\"\",IF(COUNTA(B8:C9)>0,1,0))","v":""},{"$f":"IF(D2=\"\",\"\",SUM(D2,D39,D76))","v":""},null,null,null,null,null,null,null,null,null,null,{"$f":"IF(D2=\"\",\"\",\"(\"&D2&\"/\"&$E$2&\")\")","v":""},null,"0度",{"$f":"IF(AND(Q8>=0,R8=0),0,\"\")","v":{"$error":"#VALUE!"}},{"$f":"IF(AND(Q8>=0,R8=0),\"0°0′0″\",\"\")","v":{"$error":"#VALUE!"}}]
[{"$f":"面積計算!A2","v":"件名："},{"$f":"面積計算!B2","v":"福岡市○○区△△町１丁目地内道路測量"},null,null,null,null,null,null,null,null,null,null,null,null,null,null,null,"90度",{"$f":"IF(AND(Q8=0,R8>0),90,\"\")","v":{"$error":"#VALUE!"}},{"$f":"IF(AND(Q8=0,R8>0),\"90°0′0″\",\"\")","v":{"$error":"#VALUE!"}}]
[null,null,null,null,null,null,null,null,null,null,null,null,null,null,null,null,null,"180度",{"$f":"IF(AND(Q8<0,R8=0),180,\"\")","v":{"$error":"#VALUE!"}},{"$f":"IF(AND(Q8<0,R8=0),\"180°0′0″\",\"\")","v":{"$error":"#VALUE!"}}]
["観測日",null,null,null,"天候",null,"軟風",null,"気圧",null,"温度",null,"気象補正",null,"観測者",null,null,"270度",{"$f":"IF(AND(Q8=0,R8<0),270,\"\")","v":{"$error":"#VALUE!"}},{"$f":"IF(AND(Q8=0,R8<0),\"270°0′0″\",\"\")","v":{"$error":"#VALUE!"}},"度",null,"分",null,"秒"]
[null,null,null,null,null,null,null,null,null,null,null,null,null,null,null,null,null,null,{"$f":"IF(AND(Q8>0,R8>0),Q9,\"\")","v":{"$error":"#VALUE!"}},{"$f":"IF(S6=\"\",\"\",U6&\"°\"&W6&\"′\"&Y6&\"″\")","v":{"$error":"#VALUE!"}},{"$f":"IF(S6=\"\",\"\",TRUNC(S6))","v":{"$error":"#VALUE!"}},{"$f":"IF(S6=\"\",\"\",(S6-U6)*60)","v":{"$error":"#VALUE!"}},{"$f":"IF(V6=\"\",\"\",TRUNC(V6))","v":{"$error":"#VALUE!"}},{"$f":"IF(V6=\"\",\"\",(V6-W6)*60)","v":{"$error":"#VALUE!"}},{"$f":"IF(X6=\"\",\"\",ROUND(X6,0))","v":{"$error":"#VALUE!"}}]
["測　　点",null,null,"標識の\n種　類","標　高","X座標",null,"Y座標",null,"方向角","その他",null,"座 標 系","Ⅱ","緯　度","33度","DX","DY",{"$f":"IF(AND(Q8<0,R8>0),(90-Q9),\"\")","v":{"$error":"#VALUE!"}},{"$f":"IF(S7=\"\",\"\",U7&\"°\"&W7&\"′\"&Y7&\"″\")","v":{"$error":"#VALUE!"}},{"$f":"IF(S7=\"\",\"\",TRUNC(S7))","v":{"$error":"#VALUE!"}},{"$f":"IF(S7=\"\",\"\",(S7-U7)*60)","v":{"$error":"#VALUE!"}},{"$f":"IF(V7=\"\",\"\",TRUNC(V7))","v":{"$error":"#VALUE!"}},{"$f":"IF(V7=\"\",\"\",(V7-W7)*60)","v":{"$error":"#VALUE!"}},{"$f":"IF(X7=\"\",\"\",ROUND(X7,0))","v":{"$error":"#VALUE!"}}]
["器械点",null,null,"M",null,{"$f":"IF(B8=\"\",\"\",VLOOKUP(B8,座標入力!$B$3:$D$402,2,FALSE))","v":""},null,{"$f":"IF(B8=\"\",\"\",VLOOKUP(B8,座標入力!$B$3:$D$402,3,FALSE))","v":""},null,"-",null,null,"縮尺係数",0.99990100000000004,"地　域","九州東",{"$f":"F9-F8","v":{"$error":"#VALUE!"}},{"$f":"H9-H8","v":{"$error":"#VALUE!"}},{"$f":"IF(AND(Q8<0,R8<0),(180+Q9),\"\")","v":{"$error":"#VALUE!"}},{"$f":"IF(S8=\"\",\"\",U8&\"°\"&W8&\"′\"&Y8&\"″\")","v":{"$error":"#VALUE!"}},{"$f":"IF(S8=\"\",\"\",TRUNC(S8))","v":{"$error":"#VALUE!"}},{"$f":"IF(S8=\"\",\"\",(S8-U8)*60)","v":{"$error":"#VALUE!"}},{"$f":"IF(V8=\"\",\"\",TRUNC(V8))","v":{"$error":"#VALUE!"}},{"$f":"IF(V8=\"\",\"\",(V8-W8)*60)","v":{"$error":"#VALUE!"}},{"$f":"IF(X8=\"\",\"\",ROUND(X8,0))","v":{"$error":"#VALUE!"}}]
["後視点",null,null,"S",null,{"$f":"IF(B9=\"\",\"\",VLOOKUP(B9,座標入力!$B$3:$D$402,2,FALSE))","v":""},null,{"$f":"IF(B9=\"\",\"\",VLOOKUP(B9,座標入力!$B$3:$D$402,3,FALSE))","v":""},null,{"$f":"IF(H9=\"\",\"\",INDEX($T$1:$T$9,MAX(IF($T$1:$T$9<>\"\",ROW($T$1:$T$9))),1))","v":""},null,null,"平均標高",50,"区　域","福岡県",{"$f":"ATAN(Q8/R8)*180/PI()","v":{"$error":"#VALUE!"}},null,{"$f":"IF(AND(Q8>0,R8<0),(270-Q9),\"\")","v":{"$error":"#VALUE!"}},{"$f":"IF(S9=\"\",\"\",U9&\"°\"&W9&\"′\"&Y9&\"″\")","v":{"$error":"#VALUE!"}},{"$f":"IF(S9=\"\",\"\",TRUNC(S9))","v":{"$error":"#VALUE!"}},{"$f":"IF(S9=\"\",\"\",(S9-U9)*60)","v":{"$error":"#VALUE!"}},{"$f":"IF(V9=\"\",\"\",TRUNC(V9))","v":{"$error":"#VALUE!"}},{"$f":"IF(V9=\"\",\"\",(V9-W9)*60)","v":{"$error":"#VALUE!"}},{"$f":"IF(X9=\"\",\"\",ROUND(X9,0))","v":{"$error":"#VALUE!"}}]
[null,null,null,null,null,null,null,null,null,{"$f":"IF(H9=\"\",\"\",INDEX($S$1:$S$9,MAX(IF($S$1:$S$9<>\"\",ROW($S$1:$S$9))),1))","v":""}]
{"$rows_left_out":101}